program: Orca
programVersion: 5.0.4
elementType: N C C C C C C S F F N C C C C C C C C C C C C H H H H H H H H H H H H H H H H
charge: 0
multiplicity: 1
keywords: SP DSD-BLYP D3BJ def2-QZVPP def2-QZVPP/C def2/J TightSCF
formula: C18H16F2N2S
InChI: InChI=1/C18H16F2N2S/c19-23(20,21-16-10-4-1-5-11-16)22(17-12-6-2-7-13-17)18-14-8-3-9-15-18/h1-15,21H
39 atoms
N  1.510566 -0.768729 -1.065969
C  2.51341 -0.664893 -0.068925
C  3.653918 0.097994 -0.294605
C  4.661705 0.129117 0.65242
C  4.551083 -0.615668 1.819317
C  3.424728 -1.392765 2.032719
C  2.402018 -1.412633 1.095133
S  0.394491 0.382846 -1.496602
F  -0.359866 -0.910371 -2.398119
F  1.264678 1.51632 -0.560834
N  -0.863548 0.369147 -0.360322
C  -1.964291 1.203057 -0.641331
C  -1.761354 2.520098 -1.05237
C  -2.848091 3.328712 -1.344708
C  -4.142755 2.855565 -1.197756
C  -4.341969 1.55436 -0.760942
C  -3.264617 0.726146 -0.493638
C  -0.93308 -0.6420 0.626934
C  -1.211368 -1.968019 0.306349
C  -1.263301 -2.921902 1.312283
C  -1.058985 -2.556691 2.635344
C  -0.796761 -1.23147 2.954315
C  -0.723678 -0.277619 1.952189
H  1.201365 -1.693369 -1.321015
H  3.750135 0.66025 -1.212738
H  5.542537 0.73187 0.475329
H  5.344332 -0.592445 2.554671
H  3.331285 -1.980883 2.935906
H  1.517278 -2.010738 1.271363
H  -0.760205 2.922736 -1.120408
H  -2.675974 4.347137 -1.667366
H  -4.98729 3.495681 -1.413921
H  -5.346581 1.171531 -0.638213
H  -3.435332 -0.292244 -0.171959
H  -1.389501 -2.24559 -0.722587
H  -1.474124 -3.952751 1.059869
H  -1.107198 -3.303677 3.416576
H  -0.633484 -0.942272 3.983815
H  -0.492465 0.753726 2.181187
totalener: -1399.91323071 hartree
nucrepener: 2143.22350988 hartree
electener: -3543.13674059 hartree
oneelecener: -6179.60639086 hartree
twoeener: 2636.46965027 hartree
kineticenergy: 1397.12749827 hartree
exchangeener: -48.984918509586 hartree
correlationener: -3.263613429690 hartree
xcener: -52.248531939276 hartree
chargesum: -0.0000000
charge: -0.468236 0.248088 -0.070814 -0.104137 -0.118930 -0.134337 -0.044450 1.037121 -0.533672 -0.495135 -0.262373 0.140360 -0.126317 -0.115026 -0.126457 -0.114113 -0.085467 0.250672 -0.143799 -0.135501 -0.135297 -0.113406 -0.086867 0.216899 0.096015 0.093224 0.093772 0.095839 0.102652 0.106111 0.097450 0.087772 0.094367 0.093887 0.137276 0.105978 0.098947 0.102247 0.115653
charge: 0.378723 -0.262194 0.078567 0.067835 0.064451 0.065441 0.077169 0.365403 -0.138753 -0.074946 0.231657 -0.250801 0.067856 0.066680 0.058877 0.066949 0.084026 -0.262394 0.075286 0.062740 0.065703 0.071602 0.095786 -0.206775 -0.052367 -0.058921 -0.060292 -0.059927 -0.050019 -0.060241 -0.057281 -0.062393 -0.057936 -0.052658 -0.057781 -0.058417 -0.058712 -0.057672 -0.044270
qa: -0.4682 0.2481 -0.0708 -0.1041 -0.1189 -0.1343 -0.0445 1.0371 -0.5337 -0.4951 -0.2624 0.1404 -0.1263 -0.1150 -0.1265 -0.1141 -0.0855 0.2507 -0.1438 -0.1355 -0.1353 -0.1134 -0.0869 0.2169 0.0960 0.0932 0.0938 0.0958 0.1027 0.1061 0.0975 0.0878 0.0944 0.0939 0.1373 0.1060 0.0989 0.1022 0.1157
va: 2.9208 3.5689 3.7464 3.8042 3.8371 3.8297 3.6559 3.5684 0.6819 0.7244 2.7562 3.6906 3.7324 3.8098 3.8451 3.8050 3.6993 3.6135 3.7396 3.8103 3.8297 3.7776 3.7796 1.0152 0.9906 0.9846 0.9848 0.9837 0.9906 1.0082 0.9842 0.9881 0.9819 0.9993 1.0050 0.9832 0.9865 0.9829 0.9934
total: -1401.997401751 hartree
dispersion: -0.038410439 hartree
energy: -1402.035812189402 hartree
dipole: -2.36143 2.29701 -0.06442 -3.32444 2.77259 -0.55184 11.79293 -10.77401 1.01892
magnitude: 1.16055 au
magnitude: 2.94989 debye
