program: Gaussian 09
title: 000076588
version: EM64L-G09RevD.01
frameworkgroup: C1[X(C16H26O4)]
method: RPBEPBE
basis: SDD
operation: Freq
keyword: #pfreq=noraman
keyword: PBEPBE/SDD
title: #p freq=noraman PBEPBE/SDD
converged: YES YES NO NO
title: Mulliken charges:
elementType: O O O O C C C C C C C C C C C C C C C C H H H H H H H H H H H H H H H H H H H H H H H H H H
charge: -0.264987 -0.264946 -0.241988 -0.241842 -0.383606 -0.383628 -0.369176 -0.369138 -0.378326 -0.378230 -0.519803 -0.519853 0.246948 0.246695 -0.333004 -0.332826 -0.043968 -0.044165 -0.553146 -0.553115 0.195401 0.196456 0.195436 0.196442 0.192677 0.191369 0.192583 0.191393 0.211012 0.222055 0.211329 0.221649 0.246576 0.244172 0.246512 0.244442 0.225942 0.240205 0.226027 0.240065 0.232534 0.232541 0.222291 0.220343 0.222300 0.220354
chargesum: 0.00000
title: Mulliken charges with hydrogens summed into heavy atoms:
elementType: O O O O C C C C C C C C C C C C C C C C
charge: -0.264987 -0.264946 -0.241988 -0.241842 0.008251 0.008250 0.014869 0.014837 0.054742 0.054747 -0.029055 -0.028899 0.246948 0.246695 0.133144 0.133266 0.188566 0.188375 -0.110512 -0.110461
polarizability: 2.90604943e+02 -2.46456287e+01 1.53410636e+02 1.41115279e-01 3.13292378e-02 1.36562300e+02
1716.lowfreq: -2.2082 -0.0011 0.0010 0.0015 3.5133 5.1279 7.4615 15.3900 15.7826
frequency: 4.7957 14.8692 15.7248 19.8510 21.3207 31.9392 46.5789 56.0171 57.8221 70.8113 84.0901 98.0882 104.0720 120.9717 123.8212 143.9487 147.3081 156.9793 162.8814 185.6234 221.1699 267.0474 271.1332 317.9344 328.7736 344.0834 382.9231 432.2540 448.3025 476.3669 507.0041 551.1672 553.3185 629.9611 630.6619 673.9801 679.7040 724.5645 725.9210 743.6173 787.3826 847.2710 852.2480 855.3571 899.5230 899.8668 922.3665 933.2540 933.6267 958.9972 959.1769 982.3099 982.4276 997.8064 999.7543 1008.4231 1012.6480 1012.8233 1047.3056 1064.4320 1079.8825 1084.3952 1091.8354 1101.7891 1111.0353 1121.1761 1129.4638 1151.5711 1151.9493 1199.8316 1211.9631 1212.3309 1213.3489 1234.7085 1250.5205 1267.1812 1281.4269 1283.1141 1283.6639 1285.8280 1287.1818 1299.3862 1300.4937 1314.6774 1330.2015 1335.5513 1348.5996 1359.9188 1364.5537 1367.0200 1432.7339 1432.7976 1440.6226 1440.6667 1462.8173 1464.3117 1466.7577 1468.2944 1468.3858 1474.2266 1483.2182 1489.6840 1641.1261 1641.2331 1664.3835 1664.4229 2951.7827 2953.4905 2956.2048 2965.6682 2983.3091 2983.5209 2987.5160 2993.4298 2994.7115 2995.5362 2998.8596 2998.9187 3011.0051 3029.8771 3034.9040 3039.7209 3062.7262 3063.9354 3066.5498 3066.5721 3093.3929 3093.4123 3120.6745 3120.7554 3203.9298 3203.9604
redmass: 4.2072 3.9607 5.2991 3.9952 4.8101 3.0617 4.4545 1.9928 2.4270 3.4932 2.5988 2.2853 2.5742 2.4311 4.1823 2.2923 2.9703 2.2257 2.7982 3.7673 4.0986 4.4511 4.6184 3.5447 3.8292 3.4108 2.7507 2.4570 3.4683 2.5044 2.7276 2.6478 2.6189 1.7371 1.7711 5.0999 4.9091 1.0666 1.1061 1.1952 1.3160 1.5092 4.4636 3.4379 3.5134 3.3984 1.3639 1.6671 1.6892 1.3590 1.3609 1.8222 1.8226 3.5331 1.3206 2.9099 1.5760 1.4195 4.3629 2.6502 2.3467 2.1978 3.6174 1.8950 1.7396 2.2553 2.1807 1.7202 1.7381 1.5726 1.2475 1.2435 1.2970 1.3472 1.3683 1.2139 1.2568 1.2459 1.1402 1.2238 1.1029 1.1090 1.1056 1.3887 1.3127 1.3837 1.5631 1.6625 1.7042 1.7009 1.1919 1.1918 1.0860 1.0859 1.0716 1.0703 1.0749 1.0964 1.0963 1.0935 1.0984 1.1003 9.8510 9.8599 4.7679 4.7678 1.0587 1.0589 1.0594 1.0591 1.0634 1.0632 1.0959 1.0799 1.0606 1.0787 1.0577 1.0577 1.1022 1.1000 1.0978 1.1016 1.1025 1.1025 1.1052 1.1052 1.0606 1.0606 1.0950 1.0950 1.1144 1.1144
irintensity: 0.3162 0.2603 1.2011 1.3329 0.1130 0.0399 0.1173 0.0182 0.0128 1.7266 1.1238 0.5094 0.1124 0.2869 1.3922 0.6695 2.8134 3.8755 1.6865 5.8940 9.1233 0.5760 0.7447 2.7054 41.3655 0.7948 0.1188 2.7118 0.0013 0.7686 3.2243 3.8147 3.4350 3.2777 6.0209 8.7253 0.0444 20.1308 0.2367 4.7570 0.4624 2.5790 21.6338 1.5909 1.4250 57.3971 0.2441 6.7764 137.4814 12.0836 118.1804 74.9228 9.2649 0.8464 1.5719 3.6061 24.2619 1.4761 172.4008 0.3284 0.5916 2.0030 1.4618 228.3829 0.2125 393.1494 5.7217 38.4478 0.2599 0.4415 33.9126 1.3543 93.1208 0.2069 0.1613 0.5162 34.7637 0.4710 6.4180 53.3935 0.6256 0.0013 1.5563 0.2056 8.5575 0.0564 47.1227 0.0108 0.0357 19.5052 12.0899 11.3961 27.0275 21.1879 0.1521 0.0044 0.1453 11.4962 8.9650 6.8512 0.0009 29.7492 18.5959 337.1406 8.4045 7.5461 8.6695 0.0018 0.0012 104.8275 5.4514 2.5420 0.8390 0.5680 76.2903 6.3444 24.8208 19.0576 0.1332 22.3318 1.1959 46.6919 0.9890 138.6373 4.4625 40.2414 9.8740 10.2947 9.8891 10.4787 23.3184 25.9799
temp: 298.150 k
press: 1.00000 atm
elementType: 8 8 8 8 6 6 6 6 6 6 6 6 6 6 6 6 6 6 6 6 1 1 1 1 1 1 1 1 1 1 1 1 1 1 1 1 1 1 1 1 1 1 1 1 1 1
symmnumber: 1
zpe: 1021007.0 jmol-1
zpe.correction: 0.388881 hartree
zpe.thermalcorrener: 0.413789 hartree
zpe.thermalcorrenthalpy: 0.414733 hartree
zpe.thermalcorrgfe: 0.324950 hartree
zpe.sumelectzpe: -924.571894 hartree
zpe.sumelectthermal: -924.546986 hartree
zpe.sumelectthermalent: -924.546042 hartree
zpe.sumelectthermalfe: -924.635825 hartree
dipole: -0.0011 -0.0007 0.8059
dipole: 0.8059
quadrupole: -95.2650 -135.3530 -115.9791
quadrupole: -16.5110 -0.0123 -0.0080
quadrupole: 20.2673 -19.8206 -0.4467 -16.5110 -0.0123 -0.0080
hfenergy: -924.9607749 hartree
pointgroup: C01 [X(C16H26O4)]
dipole: 0.0003309 -0.0031448 0.3170455 debye
polarizability: 290.5885619|-24.6890312|153.426008|-0.3519071|0.1414298|136.5633099 unknown
InChI: InChI=1S/C16H26O4/c1-3-13-19-15(17)11-9-7-5-6-8-10-12-16(18)20-14-4-2/h3-4H,1-2,5-14H2
charge 0 multiplicity 1
46 atoms
O  -6.895346 0.303055 0.044639
O  6.896493 -0.302837 0.048034
O  -5.833198 -1.70741 -0.480088
O  5.834567 1.718051 -0.435227
C  -0.63745 -0.433278 -0.114637
C  0.638196 0.43839 -0.11199
C  -1.941745 0.395265 -0.118719
C  1.942503 -0.39014 -0.115381
C  -3.211177 -0.484009 -0.125843
C  3.211932 0.489166 -0.116351
C  -4.502659 0.357095 -0.127351
C  4.503347 -0.351913 -0.118315
C  -5.764597 -0.486277 -0.211385
C  5.765679 0.492011 -0.1900
C  -8.220817 -0.396805 -0.041531
C  8.221942 0.398406 -0.026072
C  -9.219402 0.443272 0.702607
C  9.222836 -0.459695 0.694011
C  -10.391416 0.872656 0.17343
C  10.392991 -0.87604 0.15047
H  -0.629254 -1.099305 0.77336
H  -0.625247 -1.0996 -1.00227
H  0.628008 1.101978 0.77781
H  0.627975 1.107153 -0.99781
H  -1.953975 1.061671 0.769284
H  -1.947656 1.061104 -1.007345
H  1.952492 -1.059283 0.770595
H  1.950618 -1.053237 -1.006038
H  -3.208126 -1.152986 0.756731
H  -3.206974 -1.14728 -1.01148
H  3.207047 1.154782 0.768709
H  3.209436 1.155916 -0.999405
H  -4.56993 0.998764 0.771368
H  -4.50881 1.052759 -0.99114
H  4.5664 -0.999514 0.776577
H  4.51366 -1.042114 -0.986333
H  -8.485555 -0.515603 -1.107339
H  -8.098826 -1.403104 0.403138
H  8.483026 0.542963 -1.089591
H  8.101986 1.393712 0.443237
H  -8.959805 0.679403 1.743539
H  8.966839 -0.721111 1.729771
H  -11.110132 1.448861 0.765786
H  -10.667672 0.657429 -0.866323
H  11.11373 -1.466475 0.726122
H  10.665664 -0.635444 -0.884654
