program: Orca
programVersion: 5.0.4
elementType: N S F F N C C C C H H H H H H
charge: 0
multiplicity: 1
keywords: SP DSD-BLYP D3BJ def2-QZVPP def2-QZVPP/C def2/J TightSCF
formula: C4H6F2N2S
InChI: InChI=1/C4H6F2N2S/c5-9(6,7)8-3-1-2-4-8/h1-4H,7H2
15 atoms
N  -1.950904 -0.811706 -0.490695
S  -1.100382 0.468479 0.148495
F  -1.00078 1.096242 -1.437281
F  -1.193086 -0.342111 1.6397
N  0.532122 0.008336 0.023836
C  1.512813 0.806394 -0.528904
C  2.699867 0.16397 -0.36748
C  2.438433 -1.066748 0.295961
C  1.102141 -1.133993 0.539115
H  -2.366416 -0.601037 -1.384703
H  -2.567093 -1.249688 0.175913
H  1.286081 1.751355 -0.987735
H  3.656794 0.531684 -0.698836
H  3.157711 -1.823508 0.562575
H  0.51782 -1.901493 1.011629
totalener: -861.99826278 hartree
nucrepener: 594.98141836 hartree
electener: -1456.97968114 hartree
oneelecener: -2369.40640027 hartree
twoeener: 912.42671913 hartree
kineticenergy: 860.56473353 hartree
exchangeener: -25.291524567561 hartree
correlationener: -1.544839080897 hartree
xcener: -26.836363648458 hartree
chargesum: -0.0000000
charge: -0.455208 1.079218 -0.494617 -0.485854 -0.205813 0.003325 -0.122607 -0.122724 0.007824 0.206086 0.206988 0.112092 0.086271 0.085651 0.099367
charge: 0.473016 0.296193 -0.093242 -0.080940 0.240470 -0.072320 0.027387 0.028196 -0.068547 -0.217305 -0.216685 -0.082025 -0.075984 -0.075875 -0.082339
qa: -0.4552 1.0792 -0.4946 -0.4859 -0.2058 0.0033 -0.1226 -0.1227 0.0078 0.2061 0.2070 0.1121 0.0863 0.0857 0.0994
va: 3.0291 3.5824 0.7189 0.7313 3.2005 3.7832 3.8121 3.8002 3.8015 1.0193 1.0111 1.0084 1.0076 1.0080 1.0245
total: -862.932007025 hartree
dispersion: -0.010721357 hartree
energy: -862.942728381372 hartree
dipole: 5.51361 -6.18276 -0.66916 -3.80575 3.43416 -0.37159 -1.43387 1.22535 -0.20852
magnitude: 0.79330 au
magnitude: 2.01642 debye
