program: Orca
programVersion: 5.0.4
elementType: N S N C C C C O H H H H H H
charge: 0
multiplicity: 1
keywords: SP DSD-BLYP D3BJ def2-QZVPP def2-QZVPP/C def2/J TightSCF
formula: C4H6N2OS
InChI: InChI=1/C4H6N2OS/c5-8(7)6-3-1-2-4-6/h1-4H,5H2
14 atoms
N  -1.938437 1.011637 0.288845
S  -1.234738 -0.22397 -0.604504
N  0.34419 0.087896 0.026115
C  1.001898 1.293468 -0.022642
C  2.30614 1.064462 0.304607
C  2.451436 -0.330121 0.5342
C  1.232263 -0.910956 0.339506
O  -1.569041 -1.560511 -0.097118
H  -1.92039 0.856599 1.292274
H  -2.87593 1.212907 -0.034634
H  0.479676 2.205277 -0.2552
H  3.073361 1.817202 0.385998
H  3.351969 -0.847039 0.822762
H  0.917365 -1.93738 0.413236
totalener: -737.72209787 hartree
nucrepener: 459.19891848 hartree
electener: -1196.92101635 hartree
oneelecener: -1922.73299514 hartree
twoeener: 725.81197880 hartree
kineticenergy: 736.41317052 hartree
exchangeener: -21.578091370350 hartree
correlationener: -1.328456163089 hartree
xcener: -22.906547533438 hartree
chargesum: -0.0000000
charge: -0.476878 0.804334 -0.275276 -0.017782 -0.131015 -0.124185 -0.037419 -0.555924 0.207829 0.181449 0.110471 0.084989 0.086800 0.142607
charge: 0.431577 0.335881 0.230408 -0.089310 0.024089 0.022629 -0.077215 -0.127385 -0.207301 -0.223382 -0.085939 -0.076877 -0.077733 -0.079440
qa: -0.4769 0.8043 -0.2753 -0.0178 -0.1310 -0.1242 -0.0374 -0.5559 0.2078 0.1814 0.1105 0.0850 0.0868 0.1426
va: 2.9609 3.8238 3.1829 3.7832 3.8275 3.8220 3.8007 1.8860 1.0173 1.0286 1.0115 1.0089 1.0087 0.9922
total: -738.503162309 hartree
dispersion: -0.010214687 hartree
energy: -738.513376996244 hartree
dipole: 2.84236 -3.31500 -0.47264 3.09243 -2.05577 1.03666 2.47982 -2.35985 0.11998
magnitude: 1.14562 au
magnitude: 2.91193 debye
