program: Orca
programVersion: 5.0.4
elementType: N S N C C C C H H H H H H
charge: 2
multiplicity: 1
keywords: Freq RIJCOSX PBEh-3c
frequency: 0.00 0.00 0.00 0.00 0.00 0.00 64.47 205.61 209.62 279.16 397.17 506.47 532.31 585.84 607.83 729.13 770.59 817.03 871.89 946.34 991.45 1027.99 1035.30 1056.46 1122.89 1165.49 1169.60 1303.21 1336.01 1448.46 1517.36 1641.06 1698.01 3310.17 3314.56 3336.73 3348.38 3465.29 3594.66
frequency: 64.47 205.61 209.62 279.16 397.17 506.47 532.31 585.84 607.83 729.13 770.59 817.03 871.89 946.34 991.45 1027.99 1035.30 1056.46 1122.89 1165.49 1169.60 1303.21 1336.01 1448.46 1517.36 1641.06 1698.01 3310.17 3314.56 3336.73 3348.38 3465.29 3594.66
formula: C4H6N2S
InChI: InChI=1/C4H6N2S/c5-7-6-3-1-2-4-6/h1-4H,5H2
13 atoms
N  2.711067 0.026192 -0.214487
S  1.635208 -0.740233 0.6453
N  0.194965 -0.230626 0.223722
C  -0.93589 -0.880275 0.959631
C  -2.046639 -0.332928 0.477672
C  -1.669539 0.635916 -0.532305
C  -0.295571 0.672272 -0.661941
H  3.69428 -0.208404 -0.035977
H  2.548132 0.732938 -0.933452
H  -0.735871 -1.63232 1.711923
H  -3.054779 -0.569497 0.786658
H  -2.352881 1.248217 -1.107931
H  0.307518 1.278847 -1.318813
totalener: -661.85729238 hartree
nucrepener: 359.78655842 hartree
electener: -1021.64385081 hartree
oneelecener: -1594.93932294 hartree
twoeener: 573.29547213 hartree
kineticenergy: 659.39488896 hartree
exchangeener: -33.845869998738 hartree
correlationener: -2.664000329596 hartree
xcener: -36.509870328335 hartree
energy: -2453.8690 -413.0761 -411.6574 -296.1271 -296.0588 -295.7906 -294.4798 -239.6217 -182.2284 -182.0840 -182.0649 -42.8194 -40.2571 -36.2760 -33.6980 -32.3147 -29.5590 -28.9574 -27.8064 -27.2655 -25.7410 -25.2737 -24.1322 -23.8883 -22.9336 -22.7879 -22.5654 -19.4947 -17.9794 -14.6137 -10.2235 -9.3435 -9.1051 -7.3225 -6.4969 -6.2907 -5.0819 -4.5967 -3.2490 -3.0934 -2.9938 -2.0912 -0.9262 -0.1684 0.1376 1.5968 3.9214 4.5224 4.8072 4.9732 5.1638 5.5200 6.2006 6.3510 6.7800 6.9667 7.0812 8.4536 8.9058 9.2222 9.2300 11.1277 11.5603 12.2634 12.8377 14.3845 14.6237 15.0959 15.8966 16.1806 16.4975 16.8878 18.2437 18.7590 19.0138 20.0653 20.7988 21.4355 22.3800 26.2854 26.6037 27.4463 27.9939 28.0656 29.4170 29.4361 32.0698 32.4983 33.5039 35.4321 38.4626 40.2275 42.1895 44.6555 44.8611 45.5879 48.1777 48.1980 48.6768 51.3499 52.2849 52.3724 53.5239 53.6220 54.0540 56.1889 59.3983 59.5042 62.6813 63.5267 66.1028 70.3511 72.0304 73.8112 352.5646 360.7197 370.3275 378.5538 504.7257 510.8470 electronvolt
chargesum: 2.0000000
charge: -0.787701 1.097301 -0.576126 0.036385 -0.196662 -0.166874 0.064377 0.523227 0.503233 0.392497 0.365492 0.383821 0.361029
charge: -0.397962 1.030751 -0.091300 0.003056 -0.073677 0.092344 -0.083951 0.348512 0.327853 0.208728 0.220991 0.220740 0.193913
qa: -0.7877 1.0973 -0.5761 0.0364 -0.1967 -0.1669 0.0644 0.5232 0.5032 0.3925 0.3655 0.3838 0.3610
va: 3.0060 2.9788 3.3300 3.4217 3.7719 3.6705 3.4369 0.7149 0.7390 0.8195 0.8495 0.8388 0.8439
dispersion: -0.006886721 hartree
energy: -661.844835676577 hartree
dipole: -1.32668 2.65034 1.32366 2.02651 -1.61394 0.41257 -1.98291 1.47051 -0.51240
magnitude: 1.47812 au
magnitude: 3.75708 debye
temp: 298.15 k
press: 1.00 atm
zeropoint: 0.10116556 hartree
thermalvibcorrection: 0.00400392 hartree
thermalrotcorrection: 0.00141627 hartree
thermaltrasncorrection: 0.00141627 hartree
thermaltotal: -661.73683365 hartree
thermalcorr: 0.00683646 hartree
nonthermalcorr: 0.10116556 hartree
totalcorr: 0.10800202 hartree
thermalcorrenthalpy: 0.00094421 hartree
totalenthalpy: -661.73588944 hartree
vibrat: 0.00654865 hartree
rotat: 0.01309695 hartree
transl: 0.01905887 hartree
total: 0.03870448 hartree
totalentropycorr: -0.03870448 hartree
gibbsenthalpy: -661.77459393 hartree
gibbsminuselec: 0.07024175 hartree
