program: Orca
programVersion: 5.0.4
elementType: S F C H H H H
charge: 1
multiplicity: 1
keywords: Freq RIJCOSX PBEh-3c
frequency: 0.00 0.00 0.00 0.00 0.00 0.00 204.72 309.04 694.95 821.15 943.58 1032.09 1062.14 1149.95 1421.57 1472.72 1487.81 2678.17 3114.23 3223.72 3263.45
frequency: 204.72 309.04 694.95 821.15 943.58 1032.09 1062.14 1149.95 1421.57 1472.72 1487.81 2678.17 3114.23 3223.72 3263.45
formula: CH4FS
InChI: InChI=1/CH4FS/c1-3-2/h3H,1H3
7 atoms
S  0.937306 0.105196 -0.602343
F  1.698324 -0.989757 0.236012
C  -0.736789 -0.058642 -0.00487
H  1.310019 1.186607 0.118224
H  -1.296579 0.779431 -0.428723
H  -0.771588 -0.033008 1.082356
H  -1.140694 -0.989628 -0.400555
totalener: -537.47876415 hartree
nucrepener: 123.10034299 hartree
electener: -660.57910714 hartree
oneelecener: -976.89324735 hartree
twoeener: 316.31414021 hartree
kineticenergy: 536.03691167 hartree
exchangeener: -23.180460397348 hartree
correlationener: -1.621732470539 hartree
xcener: -24.802192867887 hartree
energy: -2449.1268 -690.9121 -291.5546 -234.9041 -177.5717 -177.3973 -177.2691 -44.1841 -32.1321 -27.5250 -23.7154 -22.4297 -22.1890 -20.2754 -19.6338 -19.1654 -17.4658 -7.4256 -5.4601 -3.8122 -1.2331 -0.9260 -0.5368 5.5424 6.0234 6.3401 6.9841 8.9519 9.8658 10.7385 12.1233 12.8814 14.2120 16.0907 19.2161 21.3060 21.7101 22.6362 23.5783 26.7454 27.4305 27.6569 28.1552 28.8902 30.2014 35.5234 35.9856 39.7800 42.5721 43.7443 53.2060 55.2464 55.4848 69.6075 365.8529 881.8106 electronvolt
chargesum: 1.0000000
charge: 0.793774 -0.336892 -0.820424 0.306950 0.339513 0.354674 0.362404
charge: 0.956052 -0.274017 -0.455207 0.175641 0.199581 0.196114 0.201835
qa: 0.7938 -0.3369 -0.8204 0.3070 0.3395 0.3547 0.3624
va: 2.8042 1.0010 3.5321 0.8778 0.8523 0.8457 0.8416
dispersion: -0.002072592 hartree
energy: -537.469191947251 hartree
dipole: -5.53114 4.61526 -0.91588 2.43206 -1.37608 1.05598 0.75205 -0.78389 -0.03184
magnitude: 1.39819 au
magnitude: 3.55392 debye
temp: 298.15 k
press: 1.00 atm
zeropoint: 0.05212285 hartree
thermalvibcorrection: 0.00129483 hartree
thermalrotcorrection: 0.00141627 hartree
thermaltrasncorrection: 0.00141627 hartree
thermaltotal: -537.41294173 hartree
thermalcorr: 0.00412737 hartree
nonthermalcorr: 0.05212285 hartree
totalcorr: 0.05625022 hartree
thermalcorrenthalpy: 0.00094421 hartree
totalenthalpy: -537.41199752 hartree
vibrat: 0.00205889 hartree
rotat: 0.01105378 hartree
transl: 0.01830619 hartree
total: 0.03141886 hartree
totalentropycorr: -0.03141886 hartree
gibbsenthalpy: -537.44341638 hartree
gibbsminuselec: 0.02577557 hartree
