program: Orca
programVersion: 5.0.4
elementType: N S N C C C C C O H H H H H H H H
charge: 0
multiplicity: 1
keywords: SP DSD-BLYP D3BJ def2-QZVPP def2-QZVPP/C def2/J TightSCF
formula: C5H8N2OS
InChI: InChI=1/C5H8N2OS/c6-9(8)7-4-2-1-3-5-7/h2-5H,1,6H2
17 atoms
N  2.272399 -0.963384 -0.087711
S  1.532561 0.540159 0.249615
N  -0.038054 -0.105927 0.257316
C  -0.940126 0.43073 1.178386
C  -2.252861 0.247245 1.090817
C  -2.898564 -0.529583 -0.017826
C  -1.866565 -0.967287 -1.015093
C  -0.563886 -0.752083 -0.867177
O  1.81215 1.323302 -0.960128
H  2.266376 -1.578327 0.717499
H  3.222366 -0.807312 -0.402831
H  -0.493464 0.993663 1.988021
H  -2.879701 0.676215 1.86085
H  -3.66837 0.077317 -0.508795
H  -3.437457 -1.397241 0.38351
H  -2.19556 -1.490652 -1.902935
H  0.166067 -1.083224 -1.590914
totalener: -776.88972953 hartree
nucrepener: 547.84803734 hartree
electener: -1324.73776687 hartree
oneelecener: -2151.99657916 hartree
twoeener: 827.25881229 hartree
kineticenergy: 775.48053895 hartree
exchangeener: -23.410865150890 hartree
correlationener: -1.468042796465 hartree
xcener: -24.878907947355 hartree
chargesum: -0.0000000
charge: -0.471953 0.735350 -0.380018 0.056302 -0.174661 0.031158 -0.172935 0.075901 -0.556730 0.175771 0.191799 0.099743 0.085256 0.044512 0.043615 0.088584 0.128306
charge: 0.434436 0.308780 0.188909 -0.109676 0.059066 0.078623 0.062853 -0.082731 -0.130649 -0.223535 -0.223221 -0.067408 -0.070173 -0.045778 -0.047685 -0.069142 -0.062670
qa: -0.4720 0.7353 -0.3800 0.0563 -0.1747 0.0312 -0.1729 0.0759 -0.5567 0.1758 0.1918 0.0997 0.0853 0.0445 0.0436 0.0886 0.1283
va: 2.8659 3.8196 2.9488 3.8041 3.8185 3.8307 3.8075 3.7846 1.8918 1.0268 1.0314 1.0012 0.9981 0.9808 0.9810 0.9980 0.9937
total: -777.757802416 hartree
dispersion: -0.012619169 hartree
energy: -777.770421584739 hartree
dipole: -6.59046 6.58451 -0.00595 -4.32631 3.33925 -0.98706 0.49029 0.48892 0.97921
magnitude: 1.39039 au
magnitude: 3.53408 debye
