program: Orca
programVersion: 5.0.4
elementType: F S N C C C C C N C C C C C H H H H H H H H H H H H
charge: 1
multiplicity: 1
keywords: Opt RIJCOSX PBEh-3c
formula: C10H12FN2S
InChI: InChI=1/C10H12FN2S/c11-14(12-7-3-1-4-8-12)13-9-5-2-6-10-13/h3-10H,1-2H2
26 atoms
F  0.29565 -2.379925 1.194274
S  0.256806 -0.771997 1.212385
N  1.228664 -0.580321 -0.147991
C  1.275803 0.788472 -0.571551
C  2.421583 1.445116 -0.680378
C  3.746162 0.84959 -0.336314
C  3.634984 -0.631504 -0.186005
C  2.480196 -1.27356 -0.081195
N  -1.171258 -0.352689 0.645369
C  -1.630372 -0.702872 -0.657428
C  -2.862094 -0.401821 -1.039916
C  -3.862741 0.294177 -0.18095
C  -3.323194 0.545309 1.186993
C  -2.093029 0.24043 1.562492
H  0.333286 1.211293 -0.890506
H  2.39203 2.446475 -1.089195
H  4.146889 1.301957 0.57831
H  4.475532 1.091472 -1.113474
H  4.539039 -1.225269 -0.213019
H  2.41493 -2.349826 -0.038606
H  -0.92016 -1.218112 -1.285521
H  -3.154236 -0.695645 -2.039046
H  -4.778882 -0.301781 -0.12047
H  -4.169712 1.237147 -0.64583
H  -3.967637 1.004568 1.923826
H  -1.708141 0.429315 2.554946
totalener: -993.73538880 hartree
nucrepener: 1033.61010145 hartree
electener: -2027.34549026 hartree
oneelecener: -3394.94595292 hartree
twoeener: 1367.60046267 hartree
kineticenergy: 988.60072529 hartree
exchangeener: -58.221570713004 hartree
correlationener: -4.972570977675 hartree
xcener: -63.194141690679 hartree
dispersion: -0.017907947 hartree
dispersion: -0.017926390 hartree
dispersion: -0.017923534 hartree
dispersion: -0.017923643 hartree
dispersion: -0.017926610 hartree
dispersion: -0.017928778 hartree
dispersion: -0.017930479 hartree
energy: -2448.3474 -688.4892 -405.4978 -404.6640 -289.6853 -289.5952 -289.3007 -289.1888 -288.6264 -288.5394 -288.4690 -288.3791 -288.2495 -288.1095 -233.7735 -176.4153 -176.3197 -176.1720 -41.7937 -35.5881 -33.6378 -29.8144 -28.6428 -27.9684 -27.5462 -27.0059 -24.7699 -24.0438 -23.6948 -23.3367 -21.9883 -21.6110 -20.4560 -19.9480 -19.7389 -19.1198 -18.9816 -18.5895 -18.3462 -17.9934 -17.9497 -17.9313 -17.5305 -16.9930 -16.7848 -16.5634 -15.8186 -15.7452 -15.0540 -14.8710 -14.8193 -13.0681 -12.8209 -11.4748 -11.1479 -5.2396 -4.2217 -3.3677 -2.9074 -2.3023 -1.6816 -1.3026 0.4296 0.6173 0.9888 1.1014 1.2382 1.5097 2.1031 2.1827 2.3482 2.4167 2.4509 2.6225 2.7618 2.8565 3.2666 3.3189 4.2423 4.6332 5.0993 5.5155 6.4601 6.5580 7.4610 7.7155 7.8727 9.2901 9.3158 9.6494 10.1081 10.3038 10.4941 10.9218 10.9824 11.3946 11.8153 11.8668 12.1136 12.4447 12.4635 12.7341 12.9768 13.0474 13.2489 13.5081 13.8937 14.4814 14.8913 15.1291 15.2898 15.4779 16.4046 16.6973 17.1483 17.6517 18.7228 18.8956 20.1161 20.4135 20.9816 21.2894 21.3574 21.9681 22.1202 22.3814 22.6144 22.6514 23.0983 23.1766 23.2697 23.6686 23.9524 24.0900 24.4398 24.6999 24.8167 25.0434 25.6340 25.7530 26.3065 27.1538 27.2922 27.8200 28.4114 28.8983 29.5927 29.8843 30.2399 30.7264 30.7842 31.6486 31.8941 32.9132 33.8653 34.1972 34.6016 34.9134 34.9267 35.7933 36.8510 37.2596 37.7895 37.9271 38.2383 39.0060 39.3363 40.1200 40.9393 41.9815 42.7789 44.4278 44.7691 45.0092 45.5690 45.7909 46.3712 48.1071 48.3949 48.5408 49.4621 51.0523 51.2206 51.4009 51.4893 52.6076 53.8285 54.1586 54.7195 55.1011 55.2662 55.8140 56.2193 56.3930 57.2872 57.4693 58.3808 59.4877 60.4760 61.9668 62.1983 62.5068 62.7085 63.1301 63.7735 67.0980 67.3945 67.4922 67.7100 68.1698 68.3217 68.5564 69.0385 69.5076 70.7221 72.0157 72.4817 72.7868 72.9598 74.0771 78.3336 79.1162 85.8001 86.4013 360.2904 360.6563 364.4460 364.9528 374.7139 375.0860 381.7184 382.4660 383.3869 384.1261 520.8443 521.5787 886.2849 electronvolt
chargesum: 1.0000000
charge: -0.380842 1.220679 -0.653086 -0.058617 -0.225022 -0.481380 -0.236676 -0.047246 -0.668688 0.004010 -0.267255 -0.463011 -0.277179 0.032648 0.299337 0.279914 0.285241 0.282478 0.281899 0.306937 0.323136 0.285340 0.287217 0.284472 0.284746 0.300948
charge: -0.322817 1.144817 -0.250212 -0.132699 -0.101688 -0.236773 -0.105635 -0.125757 -0.202120 -0.109662 -0.102415 -0.232654 -0.114789 -0.096867 0.157263 0.166235 0.167811 0.165042 0.167189 0.162517 0.168384 0.169610 0.167981 0.166469 0.170283 0.160488
qa: -0.3808 1.2207 -0.6531 -0.0586 -0.2250 -0.4814 -0.2367 -0.0472 -0.6687 0.0040 -0.2673 -0.4630 -0.2772 0.0326 0.2993 0.2799 0.2852 0.2825 0.2819 0.3069 0.3231 0.2853 0.2872 0.2845 0.2847 0.3009
va: 0.9845 3.3289 2.9725 3.6077 3.7904 3.6679 3.7729 3.6266 3.1335 3.5628 3.8067 3.6556 3.8135 3.5664 0.8752 0.8968 0.8717 0.8764 0.8961 0.8758 0.8634 0.8951 0.8711 0.8712 0.8960 0.8725
dispersion: -0.017931837 hartree
energy: -993.706264328994 hartree
dipole: -1.22466 1.02730 -0.19736 8.20545 -7.44586 0.75959 -6.02136 6.03921 0.01785
magnitude: 0.78501 au
magnitude: 1.99533 debye
