program: Orca
programVersion: 5.0.4
elementType: O S N C C C C C N C C C C C H H H H H H H H H H H H
charge: 0
multiplicity: 1
keywords: Freq RIJCOSX PBEh-3c
frequency: 0.00 0.00 0.00 0.00 0.00 0.00 25.70 29.89 54.76 81.71 127.28 143.03 215.77 220.09 316.27 329.35 384.11 445.23 448.29 486.62 530.21 544.22 580.42 646.05 648.04 675.77 683.14 758.15 768.77 777.29 785.35 925.49 926.79 992.44 996.18 999.29 1008.70 1015.16 1020.26 1022.24 1025.16 1037.85 1039.65 1090.30 1103.95 1182.38 1184.30 1234.60 1261.57 1262.06 1272.60 1276.31 1371.43 1381.42 1405.13 1407.21 1461.17 1466.86 1484.53 1492.57 1544.76 1546.34 1769.59 1770.68 1823.97 1828.18 3065.32 3065.78 3085.84 3087.18 3259.50 3261.52 3274.54 3274.69 3283.87 3284.37 3304.84 3306.57
frequency: 25.70 29.89 54.76 81.71 127.28 143.03 215.77 220.09 316.27 329.35 384.11 445.23 448.29 486.62 530.21 544.22 580.42 646.05 648.04 675.77 683.14 758.15 768.77 777.29 785.35 925.49 926.79 992.44 996.18 999.29 1008.70 1015.16 1020.26 1022.24 1025.16 1037.85 1039.65 1090.30 1103.95 1182.38 1184.30 1234.60 1261.57 1262.06 1272.60 1276.31 1371.43 1381.42 1405.13 1407.21 1461.17 1466.86 1484.53 1492.57 1544.76 1546.34 1769.59 1770.68 1823.97 1828.18 3065.32 3065.78 3085.84 3087.18 3259.50 3261.52 3274.54 3274.69 3283.87 3284.37 3304.84 3306.57
formula: C10H12N2OS
InChI: InChI=1/C10H12N2OS/c13-14(11-7-3-1-4-8-11)12-9-5-2-6-10-12/h3-10H,1-2H2
26 atoms
O  0.137692 0.85443 3.235138
S  0.077702 -0.353916 2.399575
N  -1.312344 -0.149004 1.430946
C  -1.693832 1.12123 0.990751
C  -2.418527 1.302015 -0.108325
C  -2.861886 0.181492 -1.001345
C  -2.447576 -1.140314 -0.426611
C  -1.722612 -1.252051 0.680936
N  1.379813 -0.207114 1.308694
C  1.7364 -1.348705 0.589846
C  2.39698 -1.297046 -0.561617
C  2.78999 -0.008715 -1.221005
C  2.400205 1.158022 -0.362586
C  1.741476 1.037101 0.785368
H  -1.399786 1.93815 1.633923
H  -2.717406 2.311034 -0.359163
H  -2.447934 0.308148 -2.009617
H  -3.94937 0.211647 -1.137337
H  -2.766953 -2.047021 -0.922377
H  -1.442385 -2.216515 1.086567
H  1.472021 -2.289729 1.056351
H  2.678386 -2.229718 -1.031584
H  2.326779 0.072399 -2.212293
H  3.869531 0.005262 -1.412778
H  2.684941 2.151478 -0.682542
H  1.488591 1.887439 1.402188
totalener: -969.40936328 hartree
nucrepener: 1030.87196431 hartree
electener: -2000.28132758 hartree
oneelecener: -3372.21077088 hartree
twoeener: 1371.92944330 hartree
kineticenergy: 964.40897596 hartree
exchangeener: -57.371006118860 hartree
correlationener: -4.958983213633 hartree
xcener: -62.329989332494 hartree
energy: -2442.5572 -530.0968 -399.7208 -399.7089 -285.4061 -285.3984 -285.2002 -285.1873 -284.3724 -284.3722 -284.2646 -284.2566 -284.1920 -284.1888 -228.0000 -170.6245 -170.6005 -170.3964 -32.1448 -29.2182 -29.0127 -24.8083 -24.3680 -23.5577 -23.4489 -21.8396 -20.3994 -19.4884 -19.1407 -19.1217 -17.4207 -16.1422 -15.3942 -15.0427 -14.8365 -14.7188 -14.2969 -13.8689 -13.6910 -13.5627 -13.4858 -13.3323 -12.6341 -12.2537 -11.7692 -11.6432 -11.4525 -10.8447 -10.7936 -9.9756 -8.9616 -8.6602 -8.5734 -7.0910 -6.2050 0.2619 1.0778 1.1069 1.7685 2.5551 2.8863 3.5341 4.3169 4.5025 4.7367 4.8965 5.0983 5.4364 5.9411 6.0193 6.1037 6.1970 6.2892 6.3942 6.4986 6.8830 7.5473 7.6484 7.8652 8.9575 8.9906 9.1950 10.6831 10.9969 11.8288 11.9233 12.4814 12.9177 13.5573 14.1415 14.5352 14.7362 14.8521 15.0132 15.6501 16.2336 16.2947 16.3614 16.4543 16.4694 16.6730 16.7738 16.9524 17.2814 17.8466 17.9498 18.2669 18.5891 19.1162 19.1561 19.6797 19.8985 20.4220 20.6861 20.8634 22.4053 22.6331 23.4752 24.9886 25.0414 25.3573 25.5032 25.7743 25.8444 26.3139 26.3580 26.5413 26.7239 26.9186 27.1076 27.2916 27.7739 27.9533 28.0239 28.2616 28.5208 29.2545 29.3281 29.5403 29.9068 30.7853 31.0464 31.8639 31.9916 33.1059 33.3749 33.4733 33.7747 34.7652 35.2754 35.7684 35.9913 36.8480 37.4157 37.6727 38.8550 39.4748 40.8610 41.2608 41.9505 42.2264 42.2794 42.5165 42.5741 44.6936 46.6577 47.7789 48.1898 49.0859 49.4663 49.5162 49.7356 51.1627 52.0579 52.2017 52.5821 53.0835 53.1302 54.7493 55.3202 55.4082 55.6835 56.1212 56.7503 57.4633 58.4222 58.8091 59.1986 59.4072 59.5478 59.9894 60.1750 60.6829 60.7260 61.3319 62.3064 62.4548 64.5788 64.6674 66.1844 66.4247 66.6950 66.7111 67.5436 67.8711 71.2630 71.5053 71.8787 72.3196 72.4506 73.2854 73.5123 73.7342 73.9207 75.1632 75.9939 76.3496 76.7639 77.1343 77.7041 82.8642 83.1822 91.0936 91.1229 364.9921 365.4678 368.5290 369.3323 378.7033 379.0383 385.7207 386.7001 386.9884 387.7708 527.1815 527.7070 696.9676 electronvolt
chargesum: 0.0000000
charge: -0.648373 1.036457 -0.657471 0.025518 -0.302346 -0.431469 -0.304453 0.040011 -0.659397 0.040637 -0.306081 -0.430781 -0.303887 0.031975 0.281686 0.223914 0.231382 0.228323 0.222862 0.247864 0.248336 0.222713 0.230782 0.228440 0.224022 0.279336
charge: -0.589597 0.982721 -0.261685 -0.087074 -0.175949 -0.230674 -0.178019 -0.091917 -0.260825 -0.091594 -0.179690 -0.230517 -0.175786 -0.085291 0.151113 0.139032 0.132520 0.131147 0.138985 0.135588 0.135620 0.138914 0.132153 0.131101 0.139121 0.150600
qa: -0.6484 1.0365 -0.6575 0.0255 -0.3023 -0.4315 -0.3045 0.0400 -0.6594 0.0406 -0.3061 -0.4308 -0.3039 0.0320 0.2817 0.2239 0.2314 0.2283 0.2229 0.2479 0.2483 0.2227 0.2308 0.2284 0.2240 0.2793
va: 1.8701 3.5283 3.0301 3.6852 3.8207 3.7137 3.8337 3.6886 3.0316 3.6883 3.8331 3.7136 3.8233 3.6830 0.8904 0.9203 0.8902 0.8916 0.9210 0.8990 0.8987 0.9211 0.8904 0.8914 0.9203 0.8918
dispersion: -0.018515143 hartree
energy: -969.382381925965 hartree
dipole: -0.43295 0.37367 -0.05928 0.41586 -1.00390 -0.58805 -12.67745 11.46182 -1.21564
magnitude: 1.35170 au
magnitude: 3.43574 debye
temp: 298.15 k
press: 1.00 atm
zeropoint: 0.21389863 hartree
thermalvibcorrection: 0.00973505 hartree
thermalrotcorrection: 0.00141627 hartree
thermaltrasncorrection: 0.00141627 hartree
thermaltotal: -969.15591570 hartree
thermalcorr: 0.01256760 hartree
nonthermalcorr: 0.21389863 hartree
totalcorr: 0.22646623 hartree
thermalcorrenthalpy: 0.00094421 hartree
totalenthalpy: -969.15497149 hartree
vibrat: 0.01722957 hartree
rotat: 0.01505667 hartree
transl: 0.01991037 hartree
total: 0.05219661 hartree
totalentropycorr: -0.05219661 hartree
gibbsenthalpy: -969.20716810 hartree
gibbsminuselec: 0.17521382 hartree
