program: Orca
programVersion: 5.0.4
elementType: F S C C C C C C C C C C C C H H H H H H H H
charge: 1
multiplicity: 1
keywords: Freq RIJCOSX PBEh-3c
frequency: 0.00 0.00 0.00 0.00 0.00 0.00 89.72 110.55 118.15 183.21 217.03 308.68 326.51 415.32 416.89 435.47 475.96 495.85 511.49 553.94 566.68 636.59 728.62 734.09 740.94 761.19 797.50 805.90 813.47 870.57 931.70 938.84 1021.90 1022.73 1040.22 1070.80 1072.58 1072.76 1082.46 1106.23 1118.51 1186.31 1190.08 1228.15 1235.60 1290.34 1345.56 1371.14 1386.78 1451.85 1519.61 1532.65 1543.49 1579.49 1693.65 1696.81 1699.60 1705.61 3285.84 3286.73 3289.24 3289.92 3297.98 3298.74 3309.28 3309.80
frequency: 89.72 110.55 118.15 183.21 217.03 308.68 326.51 415.32 416.89 435.47 475.96 495.85 511.49 553.94 566.68 636.59 728.62 734.09 740.94 761.19 797.50 805.90 813.47 870.57 931.70 938.84 1021.90 1022.73 1040.22 1070.80 1072.58 1072.76 1082.46 1106.23 1118.51 1186.31 1190.08 1228.15 1235.60 1290.34 1345.56 1371.14 1386.78 1451.85 1519.61 1532.65 1543.49 1579.49 1693.65 1696.81 1699.60 1705.61 3285.84 3286.73 3289.24 3289.92 3297.98 3298.74 3309.28 3309.80
formula: C12H8FS
InChI: InChI=1/C12H8FS/c13-14-11-7-3-1-5-9(11)10-6-2-4-8-12(10)14/h1-8H
22 atoms
F  0.125754 2.102522 2.161251
S  0.073254 2.087744 0.560501
C  1.289722 0.903417 0.152226
C  0.71936 -0.340468 -0.141591
C  1.562153 -1.379227 -0.476353
C  2.938185 -1.153415 -0.504095
C  3.478403 0.092483 -0.217188
C  2.647587 1.156134 0.114406
C  -0.7425 -0.306258 -0.079133
C  -1.227164 0.963811 0.252478
C  -2.569328 1.278805 0.337176
C  -3.473995 0.25259 0.092337
C  -3.019252 -1.018045 -0.231575
C  -1.658208 -1.306956 -0.327124
H  1.170477 -2.357256 -0.721393
H  3.59907 -1.968493 -0.765538
H  4.548035 0.240937 -0.255925
H  3.057105 2.133572 0.332376
H  -2.911636 2.274887 0.584653
H  -4.534739 0.449789 0.151491
H  -3.737639 -1.803333 -0.422848
H  -1.334645 -2.303339 -0.596029
totalener: -958.18965824 hartree
nucrepener: 946.05671373 hartree
electener: -1904.24637197 hartree
oneelecener: -3172.01762504 hartree
twoeener: 1267.77125307 hartree
kineticenergy: 953.53053729 hartree
exchangeener: -55.848612279071 hartree
correlationener: -4.710047165172 hartree
xcener: -60.558659444243 hartree
energy: -2447.1591 -688.5682 -290.0544 -290.0470 -289.6780 -289.6664 -289.4164 -289.4073 -288.9689 -288.9635 -288.9526 -288.9454 -288.7674 -288.7632 -232.8508 -175.5103 -175.3597 -175.2362 -41.7367 -32.6166 -30.7574 -29.8534 -28.5750 -27.7060 -26.8782 -26.6470 -24.3028 -23.2617 -23.1631 -22.6691 -21.4233 -20.5810 -20.3343 -20.0727 -19.4244 -19.2643 -18.4384 -18.3798 -18.2474 -17.8887 -17.5498 -17.2237 -16.4541 -16.0087 -15.9403 -15.6004 -15.4137 -15.2504 -13.6363 -13.1292 -12.7654 -11.7870 -6.7754 -4.8221 -4.1014 -3.7479 -3.0991 -2.8328 -1.0720 0.2125 0.5282 0.5467 1.2279 1.5429 1.5679 1.7093 1.8047 2.6554 2.9275 3.1146 3.6628 3.8687 4.4583 4.6829 4.7245 5.5939 6.1772 6.8009 6.8871 7.3136 9.1739 9.6741 10.0468 10.1072 10.4609 10.5747 10.8030 11.0415 11.0902 11.4160 11.4993 11.7036 12.0996 12.2447 12.3421 12.6827 12.7155 12.9212 13.2956 13.3383 13.6324 13.9289 13.9792 14.4903 14.7569 15.1264 15.2396 15.8753 16.1475 16.3704 17.2971 17.6145 18.8811 18.9391 19.1875 19.6249 20.9003 21.2960 21.9096 21.9396 22.2516 22.7324 23.1231 23.3405 23.6146 23.8686 24.0461 24.2600 24.6835 25.0283 25.6907 25.9620 26.6218 26.7149 27.0705 27.2000 28.1777 28.3364 29.7568 29.8382 29.8949 30.2440 30.8299 31.2338 31.2803 31.5725 31.6290 31.9100 32.8499 33.3051 33.8788 35.6681 35.7698 36.3041 36.9310 37.2111 37.4415 37.5746 37.8680 38.6312 38.9315 39.0921 39.6206 40.0449 41.1665 43.7808 44.0761 45.1798 46.1391 46.6861 47.7360 48.1269 49.7732 50.4124 50.8040 51.9205 52.2836 53.3521 53.5279 54.3739 54.8743 55.0390 55.4305 55.5023 55.8950 56.5894 57.4441 57.4878 58.3375 58.6375 59.2477 59.6317 60.2954 60.8844 63.6359 65.3695 65.8841 66.5314 67.6936 68.8385 69.1092 69.3876 70.7166 70.7540 70.8831 72.2962 72.3265 72.7596 73.2165 73.4601 74.0982 77.4318 78.3309 86.1962 87.6940 92.1577 355.2130 360.0246 366.0214 367.9309 369.7719 373.4162 378.9606 379.9956 380.6815 383.5797 391.1725 391.7604 886.3198 electronvolt
chargesum: 1.0000000
charge: -0.367214 1.037232 -0.339770 0.322114 -0.315032 -0.175504 -0.232525 -0.208905 0.321855 -0.339600 -0.208531 -0.232699 -0.175736 -0.315282 0.258296 0.287089 0.286577 0.282814 0.282918 0.286547 0.287006 0.258351
charge: -0.307943 1.075401 -0.204168 -0.014762 -0.094071 -0.059268 -0.103082 -0.077705 -0.015503 -0.203393 -0.078107 -0.102772 -0.059806 -0.093840 0.162792 0.168288 0.168385 0.170123 0.170102 0.168339 0.168225 0.162766
qa: -0.3672 1.0372 -0.3398 0.3221 -0.3150 -0.1755 -0.2325 -0.2089 0.3219 -0.3396 -0.2085 -0.2327 -0.1757 -0.3153 0.2583 0.2871 0.2866 0.2828 0.2829 0.2865 0.2870 0.2584
va: 0.9709 3.0506 3.7058 3.4464 3.7327 3.7630 3.8038 3.7556 3.4456 3.7057 3.7559 3.8043 3.7630 3.7335 0.9048 0.8849 0.8860 0.8910 0.8909 0.8860 0.8849 0.9047
dispersion: -0.016499415 hartree
energy: -958.177200814015 hartree
dipole: -0.38040 0.36224 -0.01816 -8.13977 7.98247 -0.15730 -5.05640 4.47889 -0.57751
magnitude: 0.59882 au
magnitude: 1.52208 debye
temp: 298.15 k
press: 1.00 atm
zeropoint: 0.16999066 hartree
thermalvibcorrection: 0.00731052 hartree
thermalrotcorrection: 0.00141627 hartree
thermaltrasncorrection: 0.00141627 hartree
thermaltotal: -957.99706709 hartree
thermalcorr: 0.01014307 hartree
nonthermalcorr: 0.16999066 hartree
totalcorr: 0.18013372 hartree
thermalcorrenthalpy: 0.00094421 hartree
totalenthalpy: -957.99612288 hartree
vibrat: 0.01204684 hartree
rotat: 0.01497729 hartree
transl: 0.01987578 hartree
total: 0.04689991 hartree
totalentropycorr: -0.04689991 hartree
gibbsenthalpy: -958.04302280 hartree
gibbsminuselec: 0.13417802 hartree
