program: Orca
programVersion: 5.0.4
elementType: O S C C C C C C O C C C C C C H H H H H H H H
charge: 0
multiplicity: 1
keywords: SP DSD-BLYP D3BJ def2-QZVPP def2-QZVPP/C def2/J TightSCF
formula: C12H8O2S
InChI: InChI=1/C12H8O2S/c13-15-11-7-3-1-5-9(11)14-10-6-2-4-8-12(10)15/h1-8H
23 atoms
O  0.306256 -2.645085 -0.521682
S  0.238656 -1.545302 0.482125
C  -1.234577 -0.574047 0.184601
C  -1.250823 0.78545 0.456692
C  -2.434568 1.499323 0.347417
C  -3.591734 0.842554 -0.036373
C  -3.570962 -0.513455 -0.336677
C  -2.388234 -1.223975 -0.225643
O  -0.128101 1.46787 0.816354
C  1.063498 1.086369 0.277663
C  1.352706 -0.23751 -0.015362
C  2.557837 -0.580886 -0.607723
C  3.489953 0.404765 -0.882217
C  3.210807 1.727076 -0.561383
C  1.996365 2.075435 0.005652
H  -2.436624 2.561981 0.550484
H  -4.514837 1.400345 -0.11804
H  -4.474669 -1.0162 -0.652023
H  -2.350058 -2.280689 -0.457103
H  2.755281 -1.616996 -0.85097
H  4.433027 0.142062 -1.340959
H  3.938708 2.49918 -0.770805
H  1.758691 3.107257 0.227729
totalener: -1008.74383346 hartree
nucrepener: 1059.47640427 hartree
electener: -2068.22023773 hartree
oneelecener: -3483.79746735 hartree
twoeener: 1415.57722962 hartree
kineticenergy: 1006.85502104 hartree
exchangeener: -33.165395311437 hartree
correlationener: -2.149254725638 hartree
xcener: -35.314650037075 hartree
chargesum: -0.0000000
charge: -0.602726 0.532843 0.059948 0.186833 -0.107359 -0.084211 -0.136804 -0.124187 -0.389439 0.187021 0.056734 -0.121900 -0.137701 -0.082237 -0.106623 0.110675 0.100229 0.099217 0.126600 0.126316 0.098769 0.097392 0.110609
charge: -0.148711 0.588096 -0.249478 -0.341267 0.084436 0.077335 0.067460 0.063767 0.583586 -0.341242 -0.250086 0.063789 0.067449 0.077445 0.084483 -0.052125 -0.054828 -0.058937 -0.047640 -0.047575 -0.058946 -0.054918 -0.052092
qa: -0.6027 0.5328 0.0599 0.1868 -0.1074 -0.0842 -0.1368 -0.1242 -0.3894 0.1870 0.0567 -0.1219 -0.1377 -0.0822 -0.1066 0.1107 0.1002 0.0992 0.1266 0.1263 0.0988 0.0974 0.1106
va: 1.7969 3.6570 3.5792 3.6428 3.7686 3.8141 3.8412 3.7858 2.0214 3.6433 3.5853 3.7807 3.8399 3.8176 3.7740 0.9882 0.9844 0.9888 0.9981 0.9980 0.9890 0.9847 0.9876
total: -1010.066654609 hartree
dispersion: -0.023184078 hartree
energy: -1010.089838686713 hartree
dipole: -0.83965 0.66692 -0.17273 4.52735 -3.15185 1.37550 -3.21025 3.31150 0.10124
magnitude: 1.39000 au
magnitude: 3.53310 debye
