program: Orca
programVersion: 5.0.4
elementType: C C C C C C O C C C C C C S H H H H H H H H
charge: 2
multiplicity: 1
keywords: SP DSD-BLYP D3BJ def2-QZVPP def2-QZVPP/C def2/J TightSCF
formula: C12H8OS
InChI: InChI=1/C12H8OS/c1-3-7-11-9(5-1)13-10-6-2-4-8-12(10)14-11/h1-8H
22 atoms
C  -1.292867 -0.535599 -0.492081
C  -2.54057 -1.019432 -0.931338
C  -3.669961 -0.578698 -0.300275
C  -3.595234 0.349103 0.775458
C  -2.393881 0.838415 1.225987
C  -1.233576 0.400151 0.597658
O  -0.081287 0.869052 1.034124
C  1.138953 0.6115 0.606334
C  2.199231 1.243874 1.246028
C  3.470816 0.981178 0.799165
C  3.715386 0.093076 -0.284945
C  2.686285 -0.538904 -0.924944
C  1.370256 -0.291548 -0.488022
S  0.099743 -1.06705 -1.261333
H  -2.60025 -1.724638 -1.751524
H  -4.638426 -0.937861 -0.622331
H  -4.511933 0.67617 1.249239
H  -2.334714 1.544952 2.04431
H  2.011329 1.921347 2.069494
H  4.312121 1.462167 1.281538
H  4.733898 -0.082968 -0.604867
H  2.874972 -1.215552 -1.749645
totalener: -933.02798513 hartree
nucrepener: 920.40847727 hartree
electener: -1853.43646240 hartree
oneelecener: -3068.00586810 hartree
twoeener: 1214.56940570 hartree
kineticenergy: 931.33004486 hartree
exchangeener: -30.409513825620 hartree
correlationener: -1.951558711299 hartree
xcener: -32.361072536918 hartree
chargesum: 2.0000000
charge: 0.151575 -0.062413 -0.048311 0.016593 -0.056000 0.259098 -0.209969 0.256899 -0.053136 0.014644 -0.049009 -0.061106 0.150952 0.371517 0.144823 0.170844 0.179400 0.164267 0.163368 0.179961 0.169592 0.146414
charge: -0.280011 0.106909 0.180293 0.210798 0.144122 -0.252400 0.743787 -0.252342 0.144158 0.210776 0.180291 0.106944 -0.279990 1.178722 -0.024432 -0.017016 -0.011283 -0.018297 -0.018312 -0.011266 -0.017021 -0.024429
qa: 0.1516 -0.0624 -0.0483 0.0166 -0.0560 0.2591 -0.2100 0.2569 -0.0531 0.0146 -0.0490 -0.0611 0.1510 0.3715 0.1448 0.1708 0.1794 0.1643 0.1634 0.1800 0.1696 0.1464
va: 3.5993 3.7494 3.8422 3.7607 3.7750 3.6588 2.3451 3.6557 3.7744 3.7616 3.8455 3.7497 3.5981 2.9690 0.9775 0.9686 0.9608 0.9744 0.9750 0.9608 0.9695 0.9772
total: -934.207434672 hartree
dispersion: -0.021696112 hartree
energy: -934.229130783247 hartree
dipole: -0.14761 0.15394 0.00633 1.58554 -1.64911 -0.06357 1.84931 -1.92939 -0.08008
magnitude: 0.10244 au
magnitude: 0.26038 debye
