program: Orca
programVersion: 5.0.4
elementType: P S F P H H H H
charge: 1
multiplicity: 1
keywords: SP DSD-BLYP D3BJ def2-QZVPP def2-QZVPP/C def2/J TightSCF
formula: H4FP2S
InChI: InChI=1/FH4P2S/c1-4(2)3/h2-3H2
8 atoms
P  -1.475766 -0.250276 1.09872
S  -0.192254 0.465642 -0.533121
F  -0.260434 -0.849454 -1.4357
P  1.844957 0.207364 0.186837
H  -1.10494 0.866207 1.887944
H  -2.623945 0.387297 0.576681
H  1.91242 1.559895 0.590166
H  1.496239 -0.296744 1.461325
totalener: -1181.83014733 hartree
nucrepener: 298.36085984 hartree
electener: -1480.19100717 hartree
oneelecener: -2216.86509382 hartree
twoeener: 736.67408665 hartree
kineticenergy: 1180.77237454 hartree
exchangeener: -25.288331323210 hartree
correlationener: -1.243602777794 hartree
xcener: -26.531934101004 hartree
chargesum: 1.0000000
charge: 0.258756 0.473254 -0.257869 0.277876 0.054592 0.076336 0.065694 0.051360
charge: 0.543929 0.369082 0.090865 0.565097 -0.139471 -0.140505 -0.139951 -0.149045
qa: 0.2588 0.4733 -0.2579 0.2779 0.0546 0.0763 0.0657 0.0514
va: 2.9094 2.9448 1.0283 2.9443 1.0025 0.9970 1.0002 1.0006
total: -1182.224320451 hartree
dispersion: -0.008473665 hartree
energy: -1182.232794116027 hartree
dipole: -0.38344 0.36111 -0.02233 3.17299 -2.30502 0.86798 4.43390 -3.27256 1.16134
magnitude: 1.45004 au
magnitude: 3.68570 debye
