program: Orca
programVersion: 5.0.4
elementType: P S F F P H H H H
charge: 0
multiplicity: 1
keywords: SP DSD-BLYP D3BJ def2-QZVPP def2-QZVPP/C def2/J TightSCF
formula: H4F2P2S
InChI: InChI=1/F2H4P2S/c1-5(2,3)4/h3-4H2
9 atoms
P  1.836277 -0.350336 -0.258141
S  -0.072654 0.639653 0.024555
F  -0.338162 0.547173 -1.687344
F  0.221146 0.501417 1.727065
P  -1.710524 -0.769468 0.213155
H  1.656752 -1.318198 0.752399
H  1.423273 -1.206051 -1.300773
H  -1.295651 -1.622818 -0.830782
H  -1.131846 -1.555159 1.231699
totalener: -1281.77034865 hartree
nucrepener: 413.36046120 hartree
electener: -1695.13080985 hartree
oneelecener: -2599.26161381 hartree
twoeener: 904.13080396 hartree
kineticenergy: 1280.61074816 hartree
exchangeener: -28.518782447948 hartree
correlationener: -1.449550956045 hartree
xcener: -29.968333403993 hartree
chargesum: 0.0000000
charge: 0.130850 0.575795 -0.494692 -0.493347 0.130419 0.036569 0.038455 0.036358 0.039591
charge: 0.444639 0.107063 -0.165423 -0.164758 0.444638 -0.165638 -0.167414 -0.165537 -0.167570
qa: 0.1309 0.5758 -0.4947 -0.4933 0.1304 0.0366 0.0385 0.0364 0.0396
va: 2.9645 3.1545 0.6967 0.6977 2.9638 0.9996 0.9998 0.9993 0.9997
total: -1282.322583318 hartree
dispersion: -0.009588763 hartree
energy: -1282.332172080382 hartree
dipole: 0.61035 -0.47704 0.13331 -5.33923 4.15801 -1.18121 -0.13566 0.10626 -0.02940
magnitude: 1.18908 au
magnitude: 3.02239 debye
