program: Orca
programVersion: 5.0.4
elementType: P S P H H H H
charge: 2
multiplicity: 1
keywords: Opt RIJCOSX PBEh-3c
formula: H4P2S
InChI: InChI=1/H4P2S/c1-3-2/h1-2H2
7 atoms
P  1.606238 0.204449 -0.300215
S  0.116233 -0.953452 -0.697968
P  -1.882246 0.009764 -0.660292
H  1.484277 1.479802 0.283628
H  2.866919 -0.311123 -0.655786
H  -2.446097 -1.169938 -0.115841
H  -1.745324 0.740499 0.544075
totalener: -1081.17975630 hartree
nucrepener: 200.41345755 hartree
electener: -1281.59321385 hartree
oneelecener: -1871.46662840 hartree
twoeener: 589.87341455 hartree
kineticenergy: 1079.86331870 hartree
exchangeener: -39.835225027359 hartree
correlationener: -2.408082552428 hartree
xcener: -42.243307579787 hartree
dispersion: -0.003209750 hartree
dispersion: -0.003209342 hartree
dispersion: -0.003208845 hartree
dispersion: -0.003210295 hartree
energy: -2452.1175 -2130.3166 -2127.7661 -238.1433 -200.4300 -197.8450 -180.6867 -180.6605 -180.5450 -148.4983 -148.4611 -148.4100 -145.9134 -145.8204 -145.7921 -36.8092 -32.0684 -29.8236 -26.1677 -25.3761 -23.3674 -22.8419 -22.1706 -19.7385 -15.4893 -12.3481 -11.5882 -9.9531 -9.0704 -8.0575 -6.6006 -5.0500 -1.5827 -0.8948 0.1009 0.3529 1.3283 1.6991 2.6455 3.2631 3.3979 3.9973 4.4181 5.1044 6.1186 6.4008 7.0998 7.6586 8.4953 9.5846 10.0441 10.8716 11.7924 13.4447 13.4904 14.0857 16.9243 18.4606 20.6833 21.8302 23.3118 23.9579 electronvolt
chargesum: 2.0000000
charge: 0.407783 0.202556 0.239966 0.313135 0.344095 0.258565 0.233901
charge: 0.574046 0.402199 0.348622 0.192885 0.213200 0.143861 0.125188
qa: 0.4078 0.2026 0.2400 0.3131 0.3441 0.2586 0.2339
va: 3.7142 2.7531 2.8458 0.8913 0.8761 0.9129 0.9247
dispersion: -0.003210073 hartree
energy: -1081.177194528257 hartree
dipole: 0.48523 0.73076 1.21600 0.98781 -0.02283 0.96498 1.95968 -1.14839 0.81129
magnitude: 1.75157 au
magnitude: 4.45215 debye
