program: Orca
programVersion: 5.0.4
elementType: P S P H H H H
charge: 2
multiplicity: 1
keywords: SP DSD-BLYP D3BJ def2-QZVPP def2-QZVPP/C def2/J TightSCF
formula: H4P2S
InChI: InChI=1/H4P2S/c1-3-2/h1-2H2
7 atoms
P  1.653777 0.440998 0.230916
S  0.163772 -0.716902 -0.166838
P  -1.834706 0.246314 -0.129161
H  1.531816 1.716352 0.814758
H  2.914459 -0.074573 -0.124656
H  -2.398557 -0.933388 0.415289
H  -1.697785 0.977049 1.075205
totalener: -1081.63878422 hartree
nucrepener: 200.39229733 hartree
electener: -1282.03108155 hartree
oneelecener: -1872.39911870 hartree
twoeener: 590.36803715 hartree
kineticenergy: 1080.76687717 hartree
exchangeener: -22.059661850252 hartree
correlationener: -1.039573399925 hartree
xcener: -23.099235250177 hartree
chargesum: 2.0000000
charge: 0.577629 0.290687 0.425446 0.226488 0.248251 0.127031 0.104467
charge: 0.952896 0.661631 0.722427 -0.062800 -0.051520 -0.103032 -0.119602
qa: 0.5776 0.2907 0.4254 0.2265 0.2483 0.1270 0.1045
va: 3.8633 2.8906 2.9104 0.9505 0.9427 0.9894 0.9905
total: -1081.890739849 hartree
dispersion: -0.007307049 hartree
energy: -1081.898046898224 hartree
dipole: 0.48523 0.88658 1.37181 0.98781 -0.08521 0.90260 1.95968 -1.24679 0.71289
magnitude: 1.79018 au
magnitude: 4.55029 debye
