program: Orca
programVersion: 5.0.4
elementType: F S P C C P C C H H H H H H H H H H H H
charge: 1
multiplicity: 1
keywords: Opt RIJCOSX PBEh-3c
formula: C4H12FP2S
InChI: InChI=1/C4H12FP2S/c1-6(2)8(5)7(3)4/h1-4H3
20 atoms
F  0.683493 -0.596948 1.717756
S  0.094429 0.490125 0.681922
P  -1.559256 -0.741427 -0.148335
C  -2.28656 0.627143 -1.139864
C  -2.60137 -0.694957 1.35781
P  1.388411 0.537796 -1.039234
C  2.849486 1.333177 -0.270234
C  1.880728 -1.22309 -1.162934
H  -3.243348 0.253983 -1.51363
H  -1.673158 0.851457 -2.011011
H  -2.485415 1.539873 -0.579473
H  -2.827484 0.307874 1.717235
H  -2.153563 -1.285306 2.15536
H  -3.544243 -1.182471 1.097939
H  3.255088 0.777601 0.572935
H  2.617501 2.352868 0.032074
H  3.620346 1.394117 -1.040875
H  2.370213 -1.598936 -0.266826
H  2.587108 -1.291368 -1.992599
H  1.027595 -1.851513 -1.412217
totalener: -1338.35885711 hartree
nucrepener: 698.85284478 hartree
electener: -2037.21170189 hartree
oneelecener: -3221.07334517 hartree
twoeener: 1183.86164329 hartree
kineticenergy: 1334.75547114 hartree
exchangeener: -58.798073516543 hartree
correlationener: -4.252672579959 hartree
xcener: -63.050746096502 hartree
dispersion: -0.012094675 hartree
energy: -2446.2476 -2121.1242 -2121.0880 -688.6223 -288.5850 -288.5682 -288.5527 -288.4533 -232.0166 -191.0949 -191.0326 -174.6936 -174.4749 -174.4046 -139.1800 -139.1102 -139.1004 -139.0577 -139.0379 -138.9868 -41.5931 -29.2687 -27.6517 -26.6296 -25.7486 -25.6998 -22.1640 -21.8984 -19.9397 -19.7051 -19.5863 -18.0016 -17.7850 -17.6867 -17.3776 -17.1882 -17.0618 -16.8969 -16.8528 -15.7499 -15.4687 -15.1048 -14.8718 -13.0923 -12.6060 -6.0936 -4.8202 -4.3411 -3.0775 -1.5547 -0.8832 -0.7583 -0.2681 0.2278 0.4560 0.7234 1.0637 1.1901 1.3576 1.7711 2.1265 2.3114 2.4074 2.9089 5.9438 6.2332 6.6494 6.9442 7.1408 7.6718 7.8839 8.3753 8.5429 8.7732 8.9930 9.6743 10.0789 11.2414 11.9212 12.4732 12.8378 12.9590 13.7340 14.2252 14.3427 14.4829 14.6697 14.8200 14.8733 15.0440 15.5295 16.4341 17.1268 17.7083 18.2267 19.0597 19.4474 21.6649 22.3860 22.6023 23.2441 23.4006 23.5564 23.7155 23.8004 24.2542 24.4205 24.8066 25.0253 25.2305 25.9062 26.5775 26.6186 27.5533 28.0645 29.1784 30.0155 30.0760 30.5382 31.4316 32.2242 32.3846 32.7303 32.8614 37.4941 38.8179 42.7875 43.1622 43.2302 43.8635 44.0865 45.6210 46.0574 46.3993 46.7697 54.2396 54.2907 56.6140 56.9314 58.2729 58.4470 58.5678 58.6716 59.0637 59.2825 59.3530 59.4074 71.7396 368.6675 368.8523 369.8723 370.3443 884.0079 electronvolt
chargesum: 1.0000000
charge: -0.381173 0.493750 0.414107 -0.893439 -0.875236 0.393438 -0.863307 -0.868022 0.310401 0.300463 0.285212 0.285453 0.301011 0.305279 0.291393 0.296904 0.304021 0.293902 0.303640 0.302203
charge: -0.334777 0.636678 0.398733 -0.535800 -0.531005 0.381253 -0.523495 -0.521853 0.180767 0.166212 0.157535 0.158570 0.170160 0.178977 0.161327 0.169738 0.177795 0.162966 0.177653 0.168566
qa: -0.3812 0.4938 0.4141 -0.8934 -0.8752 0.3934 -0.8633 -0.8680 0.3104 0.3005 0.2852 0.2855 0.3010 0.3053 0.2914 0.2969 0.3040 0.2939 0.3036 0.3022
va: 0.9407 2.6455 2.9099 3.6345 3.6383 3.0428 3.6470 3.6434 0.8756 0.8809 0.8830 0.8837 0.8797 0.8787 0.8800 0.8814 0.8781 0.8809 0.8772 0.8822
dispersion: -0.012104361 hartree
energy: -1338.351348475003 hartree
dipole: -1.31676 1.17202 -0.14473 1.02933 -0.74111 0.28822 -3.58353 3.17441 -0.40912
magnitude: 0.52096 au
magnitude: 1.32417 debye
