program: Orca
programVersion: 5.0.4
elementType: S P C C C C O H H H H H H H H H H H
charge: 0
multiplicity: 1
keywords: Freq RIJCOSX PBEh-3c
frequency: 0.00 0.00 0.00 0.00 0.00 0.00 49.56 79.27 112.54 138.48 183.90 195.96 250.60 256.88 337.10 343.16 374.31 419.12 686.69 700.15 746.78 784.59 844.86 1018.10 1031.27 1047.51 1061.12 1076.21 1102.96 1118.05 1124.50 1304.44 1318.16 1324.15 1349.81 1467.13 1470.65 1506.97 1523.06 1546.03 1550.00 1555.50 1560.03 2448.16 3115.23 3118.50 3120.97 3121.37 3166.96 3176.51 3202.25 3203.92 3206.80 3208.30
frequency: 49.56 79.27 112.54 138.48 183.90 195.96 250.60 256.88 337.10 343.16 374.31 419.12 686.69 700.15 746.78 784.59 844.86 1018.10 1031.27 1047.51 1061.12 1076.21 1102.96 1118.05 1124.50 1304.44 1318.16 1324.15 1349.81 1467.13 1470.65 1506.97 1523.06 1546.03 1550.00 1555.50 1560.03 2448.16 3115.23 3118.50 3120.97 3121.37 3166.96 3176.51 3202.25 3203.92 3206.80 3208.30
formula: C4H11OPS
InChI: InChI=1/C4H11OPS/c1-3-6(4-2)7-5/h7H,3-4H2,1-2H3
18 atoms
S  -0.161914 1.992206 -0.029869
P  -0.0098 -0.039283 0.81721
C  1.33049 -0.637034 -0.309288
C  2.702826 -0.084541 0.049774
C  -1.492165 -0.682065 -0.093052
C  -2.80073 -0.280053 0.574071
O  0.164088 1.950641 -1.49435
H  0.959379 2.367825 0.673254
H  1.075474 -0.38516 -1.340683
H  1.326961 -1.727538 -0.229258
H  3.474806 -0.560275 -0.554648
H  2.951561 -0.252941 1.097876
H  2.76513 0.985927 -0.147106
H  -1.456717 -0.346982 -1.133033
H  -1.397767 -1.770933 -0.112634
H  -2.921972 0.803268 0.606862
H  -2.857154 -0.649305 1.597977
H  -3.652596 -0.683658 0.026996
totalener: -972.43383178 hartree
nucrepener: 488.36059152 hartree
electener: -1460.79442330 hartree
oneelecener: -2308.91728425 hartree
twoeener: 848.12286095 hartree
kineticenergy: 969.52052225 hartree
exchangeener: -45.054708588958 hartree
correlationener: -3.436343135230 hartree
xcener: -48.491051724188 hartree
energy: -2440.5715 -2115.8442 -529.4323 -284.5442 -284.4479 -284.0624 -284.0308 -226.3531 -185.8368 -168.9506 -168.8995 -168.7765 -133.8958 -133.8607 -133.8110 -30.2989 -24.1786 -23.3369 -21.6496 -20.1379 -18.8586 -16.6484 -14.7659 -14.3786 -13.8633 -13.4833 -12.8837 -12.6344 -11.9817 -11.9284 -11.6312 -11.1672 -11.0475 -10.0224 -8.8781 -8.3508 -7.3882 0.3306 1.3875 1.7155 2.2133 4.0309 4.3717 4.7183 4.9516 5.0897 5.2477 5.8416 5.9393 6.1649 6.2481 6.3121 6.6466 7.4280 10.7082 11.3646 11.7807 12.1861 13.0009 13.3571 13.6689 14.6806 14.7642 15.2240 15.6349 16.0927 16.5532 17.7691 18.1378 18.6553 19.0152 19.3025 20.6858 21.0842 21.8175 22.1384 22.2240 22.5810 23.1719 24.2600 25.3777 26.4108 27.0581 27.5296 27.6790 27.8499 28.2411 28.3987 28.8729 28.9356 29.0832 29.4969 30.2243 31.2324 31.9835 32.7344 33.1357 33.3990 34.5734 36.4255 39.7380 41.3746 42.9993 44.2785 44.6885 46.2765 52.2212 52.3493 52.9827 53.6964 54.2768 54.6369 54.9718 55.5529 56.0092 57.9440 58.2774 61.5457 62.4673 64.0101 64.4693 65.2351 65.3540 65.7421 66.1207 71.7649 71.8963 76.3817 371.0752 372.2184 379.2960 379.5785 694.1973 electronvolt
chargesum: -0.0000000
charge: 0.405309 0.281934 -0.641799 -0.648775 -0.653730 -0.642366 -0.675247 0.140769 0.286373 0.247094 0.238782 0.222257 0.226625 0.271411 0.253053 0.225471 0.226960 0.235879
charge: 0.530239 0.256105 -0.400696 -0.373033 -0.403489 -0.373183 -0.652111 0.053352 0.150615 0.139770 0.136127 0.128221 0.129703 0.142657 0.141120 0.128911 0.131373 0.134320
qa: 0.4053 0.2819 -0.6418 -0.6488 -0.6537 -0.6424 -0.6752 0.1408 0.2864 0.2471 0.2388 0.2223 0.2266 0.2714 0.2531 0.2255 0.2270 0.2359
va: 3.1631 2.9312 3.6729 3.7183 3.6740 3.7090 1.7555 0.9232 0.8870 0.8957 0.9071 0.9084 0.9093 0.8887 0.8947 0.9112 0.9080 0.9075
dispersion: -0.010302819 hartree
energy: -972.419619284817 hartree
dipole: 0.65598 -0.63534 0.02064 -6.94037 6.24440 -0.69597 -0.54084 1.29127 0.75043
magnitude: 1.02369 au
magnitude: 2.60202 debye
temp: 298.15 k
press: 1.00 atm
zeropoint: 0.15183662 hartree
thermalvibcorrection: 0.00724966 hartree
thermalrotcorrection: 0.00141627 hartree
thermaltrasncorrection: 0.00141627 hartree
thermaltotal: -972.25770046 hartree
thermalcorr: 0.01008221 hartree
nonthermalcorr: 0.15183662 hartree
totalcorr: 0.16191882 hartree
thermalcorrenthalpy: 0.00094421 hartree
totalenthalpy: -972.25675625 hartree
vibrat: 0.01284830 hartree
rotat: 0.01380012 hartree
transl: 0.01932909 hartree
total: 0.04597751 hartree
totalentropycorr: -0.04597751 hartree
gibbsenthalpy: -972.30273376 hartree
gibbsminuselec: 0.11688552 hartree
