program: Orca
programVersion: 5.0.4
elementType: S P C C C C H H H H H H H H H H H
charge: 2
multiplicity: 1
keywords: SP DSD-BLYP D3BJ def2-QZVPP def2-QZVPP/C def2/J TightSCF
formula: C4H11PS
InChI: InChI=1/C4H11PS/c1-3-5(6)4-2/h6H,3-4H2,1-2H3
17 atoms
S  -0.27806 1.022104 1.225304
P  0.057922 -0.2247 -0.254542
C  -1.429196 -0.938879 -0.938794
C  -2.73227 -0.469227 -0.295218
C  1.714641 -0.579156 -0.843877
C  2.861993 0.145298 -0.150716
H  1.019002 1.333955 1.467114
H  -1.379837 -0.720597 -2.019537
H  -1.282366 -2.030581 -0.864319
H  -2.902723 0.598901 -0.419848
H  -2.807426 -0.744077 0.755747
H  -3.545086 -0.979981 -0.81192
H  1.66385 -0.365094 -1.925723
H  1.795816 -1.678006 -0.77406
H  2.816063 1.2261 -0.276308
H  2.957203 -0.12191 0.900882
H  3.784156 -0.180323 -0.633654
totalener: -896.79801767 hartree
nucrepener: 386.07168214 hartree
electener: -1282.86969981 hartree
oneelecener: -1975.00716671 hartree
twoeener: 692.13746690 hartree
kineticenergy: 895.74778039 hartree
exchangeener: -22.265837026884 hartree
correlationener: -1.254294628156 hartree
xcener: -23.520131655040 hartree
chargesum: 2.0000000
charge: 0.260181 0.663231 -0.079323 -0.100737 -0.076278 -0.105942 0.219547 0.146246 0.146810 0.088824 0.087965 0.140111 0.151234 0.152536 0.080653 0.081010 0.143932
charge: 0.935544 0.766721 0.049140 0.274044 0.053424 0.274678 -0.138452 -0.003228 -0.002763 -0.043466 -0.043314 -0.016209 -0.001743 -0.001696 -0.044616 -0.044582 -0.013480
qa: 0.2602 0.6632 -0.0793 -0.1007 -0.0763 -0.1059 0.2195 0.1462 0.1468 0.0888 0.0880 0.1401 0.1512 0.1525 0.0807 0.0810 0.1439
va: 2.7597 4.0649 3.8691 3.8622 3.8554 3.8740 0.9776 0.9808 0.9810 0.9917 0.9920 0.9966 0.9804 0.9797 0.9941 0.9942 1.0005
total: -897.332811322 hartree
dispersion: -0.012625192 hartree
energy: -897.345436513765 hartree
dipole: 1.94384 -1.40307 0.54076 -3.26360 2.88034 -0.38326 -4.12463 3.64170 -0.48293
magnitude: 0.82008 au
magnitude: 2.08449 debye
