program: Orca
programVersion: 5.0.4
elementType: C C P C C S F P C C C C H H H H H H H H H H H H H H H H H H H H
charge: 1
multiplicity: 1
keywords: SP DSD-BLYP D3BJ def2-QZVPP def2-QZVPP/C def2/J TightSCF
formula: C8H20FP2S
InChI: InChI=1/C8H20FP2S/c1-5-10(6-2)12(9)11(7-3)8-4/h5-8H2,1-4H3
32 atoms
C  2.7565 0.498404 -2.462453
C  2.98009 0.158377 -0.994415
P  1.587853 0.698061 0.088579
C  1.970598 -0.045143 1.73548
C  3.089223 0.757857 2.400864
S  0.054008 -0.611191 -0.635513
F  0.320116 -2.095606 -0.051303
P  -1.578474 -0.043636 0.749837
C  -2.831042 -1.21751 0.072947
C  -3.218346 -1.121392 -1.394074
C  -1.981143 1.555353 -0.089516
C  -3.298868 2.076411 0.489932
H  2.545792 1.557591 -2.605059
H  3.651102 0.261719 -3.035693
H  1.937754 -0.072715 -2.89972
H  3.84441 0.711505 -0.614757
H  3.202046 -0.899891 -0.84597
H  1.064985 -0.00616 2.343042
H  2.259002 -1.090841 1.625131
H  2.824893 1.80736 2.5258
H  4.026192 0.703626 1.847902
H  3.281404 0.349115 3.391491
H  -2.486838 -2.221389 0.332892
H  -3.705071 -1.054842 0.713769
H  -3.96735 -1.877507 -1.624964
H  -2.375445 -1.296719 -2.062784
H  -3.652623 -0.154781 -1.644807
H  -2.052915 1.45778 -1.173833
H  -1.175391 2.257957 0.128904
H  -3.508486 3.062926 0.08035
H  -3.259188 2.177383 1.574653
H  -4.143282 1.435658 0.238104
totalener: -1495.37752975 hartree
nucrepener: 1160.79326255 hartree
electener: -2656.17079230 hartree
oneelecener: -4350.05413829 hartree
twoeener: 1693.88334599 hartree
kineticenergy: 1493.46631152 hartree
exchangeener: -39.958792980612 hartree
correlationener: -2.363840578501 hartree
xcener: -42.322633559113 hartree
chargesum: 1.0000000
charge: -0.157665 -0.164657 0.276065 -0.169684 -0.161809 0.423184 -0.310107 0.283293 -0.162272 -0.140535 -0.149540 -0.174798 0.083649 0.086384 0.057570 0.081569 0.092147 0.098469 0.090926 0.079345 0.068378 0.089226 0.098685 0.070290 0.090301 0.055417 0.065350 0.064519 0.094352 0.088742 0.084736 0.068472
charge: 0.212039 -0.035694 0.459736 -0.032723 0.224532 0.462878 0.056846 0.482216 -0.049942 0.217592 -0.049527 0.224860 -0.056815 -0.049870 -0.068545 -0.053489 -0.060735 -0.067880 -0.063047 -0.056697 -0.059657 -0.048705 -0.059167 -0.051198 -0.048016 -0.068095 -0.059768 -0.068382 -0.070292 -0.048791 -0.055103 -0.058562
qa: -0.1577 -0.1647 0.2761 -0.1697 -0.1618 0.4232 -0.3101 0.2833 -0.1623 -0.1405 -0.1495 -0.1748 0.0836 0.0864 0.0576 0.0816 0.0921 0.0985 0.0909 0.0793 0.0684 0.0892 0.0987 0.0703 0.0903 0.0554 0.0653 0.0645 0.0944 0.0887 0.0847 0.0685
va: 3.8968 3.8440 3.0762 3.8290 3.9104 2.8076 0.9624 2.9578 3.8593 3.8836 3.8203 3.9166 0.9957 1.0035 1.0007 1.0025 0.9904 1.0010 0.9905 0.9950 0.9969 0.9989 0.9981 1.0088 1.0031 1.0043 1.0033 0.9917 1.0003 0.9984 0.9943 0.9984
total: -1496.514962387 hartree
dispersion: -0.028554620 hartree
energy: -1496.543517007296 hartree
dipole: -1.89109 1.89674 0.00565 8.04259 -7.62844 0.41415 -2.28352 2.19562 -0.08791
magnitude: 0.42342 au
magnitude: 1.07624 debye
