program: Orca
programVersion: 5.0.4
elementType: C C P C C S F F P C C C C H H H H H H H H H H H H H H H H H H H H
charge: 0
multiplicity: 1
keywords: Opt RIJCOSX PBEh-3c
formula: C8H20F2P2S
InChI: InChI=1/C8H20F2P2S/c1-5-11(6-2)13(9,10)12(7-3)8-4/h5-8H2,1-4H3
33 atoms
C  -3.69043 0.524012 -1.851556
C  -2.420013 0.89759 -1.088144
P  -1.659727 -0.643049 -0.415644
C  -2.829049 -1.09019 0.950243
C  -3.279904 0.010828 1.89821
S  -0.016913 0.099434 0.839445
F  -0.211496 1.774117 0.358966
F  0.145319 -1.623318 1.173493
P  1.514581 0.120325 -0.739064
C  2.687022 1.330128 0.028285
C  3.939734 1.449917 -0.836078
C  2.407684 -1.478315 -0.499361
C  3.189423 -1.720696 0.782496
H  -3.500972 -0.231076 -2.615834
H  -4.469201 0.139224 -1.191884
H  -4.099028 1.400651 -2.353884
H  -1.694403 1.340446 -1.770909
H  -2.628228 1.640714 -0.320582
H  -2.351627 -1.904627 1.495388
H  -3.692216 -1.538732 0.448653
H  -3.842241 0.790127 1.384302
H  -2.434381 0.486077 2.395533
H  -3.928394 -0.397071 2.674325
H  2.172108 2.287931 0.074067
H  2.94665 1.050442 1.050492
H  4.513205 0.522979 -0.866659
H  4.597687 2.224162 -0.441912
H  3.6947 1.721825 -1.863553
H  3.077923 -1.525464 -1.365301
H  1.674872 -2.268255 -0.665371
H  3.644155 -2.711845 0.760946
H  2.545002 -1.676272 1.656647
H  3.997959 -1.002016 0.914247
totalener: -1595.18932549 hartree
nucrepener: 1345.08131463 hartree
electener: -2940.27064013 hartree
oneelecener: -4877.73770313 hartree
twoeener: 1937.46706300 hartree
kineticenergy: 1589.56694336 hartree
exchangeener: -77.750388069911 hartree
correlationener: -6.100400800738 hartree
xcener: -83.850788870650 hartree
dispersion: -0.022225127 hartree
dispersion: -0.022227848 hartree
dispersion: -0.022228953 hartree
dispersion: -0.022216170 hartree
dispersion: -0.022226638 hartree
dispersion: -0.022223947 hartree
dispersion: -0.022222981 hartree
dispersion: -0.022216172 hartree
energy: -2441.0211 -2116.0111 -2115.9696 -681.0349 -680.9844 -284.3744 -284.3313 -284.2932 -284.1870 -284.1073 -284.0568 -283.9209 -283.7546 -226.5438 -185.9332 -185.8911 -169.2437 -168.9936 -168.9443 -134.0027 -133.9590 -133.9516 -133.9090 -133.8997 -133.8577 -33.8716 -33.5385 -24.2737 -24.0529 -23.0986 -23.0410 -22.5770 -20.2065 -19.7058 -19.1824 -19.1384 -16.7948 -16.1935 -15.0675 -14.6835 -14.5346 -14.2472 -14.0148 -13.6686 -13.2836 -12.9645 -12.8490 -12.6187 -12.4448 -12.1737 -11.9979 -11.9316 -11.8248 -11.7435 -11.4144 -11.2182 -11.1738 -10.9629 -10.9286 -10.4294 -9.9480 -9.8299 -9.4682 -9.1475 -7.7392 -7.5510 0.0194 0.4418 1.8241 2.0254 2.9007 3.2654 3.5823 4.1160 4.3425 4.7403 4.8975 5.0073 5.0654 5.1306 5.3037 5.4007 5.6237 5.6638 5.6735 5.9197 6.0447 6.1220 6.1702 6.4175 6.4491 6.7251 6.7769 7.1309 7.3288 7.4872 7.7041 10.3822 11.0756 11.4209 11.7129 12.1202 12.3256 12.7525 12.9348 13.0499 13.5091 13.8695 14.0259 14.2388 14.3217 14.6669 14.8614 15.4528 15.8973 15.9669 16.1114 16.4694 16.8375 17.0506 17.3933 17.8163 18.0957 18.7673 18.9505 19.0530 20.0662 20.1313 20.5968 20.9976 21.0339 21.3899 21.7689 22.0589 22.5948 22.6491 23.1550 23.7042 24.0425 24.5989 24.8849 25.4026 26.2803 26.7366 26.9011 27.1915 27.4299 27.5104 27.6242 27.6844 28.1603 28.2681 28.4158 28.6642 28.7472 28.8976 29.1737 29.4020 29.4950 30.0892 30.2384 30.3556 30.3945 30.9088 31.0114 31.7793 31.8877 32.3974 32.7965 34.1161 34.4500 35.0463 36.1544 36.2706 36.6999 36.8168 37.1416 37.7951 38.2367 38.7995 39.4665 39.8208 40.3569 40.8109 40.9943 41.4480 41.8093 43.3609 43.4468 43.6002 44.1251 44.9291 45.1819 45.2257 45.3868 45.8579 46.8240 46.9873 49.7373 51.1183 54.0152 54.0988 54.4285 54.7749 54.9968 55.0671 55.1222 55.2053 55.3188 55.7973 56.5218 56.7297 61.5203 61.5420 62.9448 63.1210 64.5091 64.8164 65.1407 65.2482 65.6028 65.6444 65.8497 65.8643 66.0131 66.1704 66.2652 66.5296 71.2370 71.3564 71.5578 72.0934 72.8854 78.7211 371.8437 372.0932 372.3055 372.3832 379.1766 379.5154 379.6560 379.9574 887.7295 888.4924 electronvolt
chargesum: 0.0000000
charge: -0.670518 -0.644277 0.425841 -0.661546 -0.640988 0.531347 -0.516501 -0.518706 0.422089 -0.645676 -0.663872 -0.661603 -0.643240 0.229880 0.218555 0.241830 0.272301 0.264701 0.283308 0.246053 0.219306 0.236801 0.231842 0.283495 0.251934 0.221939 0.241341 0.231293 0.239655 0.285696 0.229474 0.249066 0.209180
charge: -0.374321 -0.404998 0.363588 -0.405904 -0.373302 0.659673 -0.501124 -0.505664 0.359448 -0.400462 -0.372893 -0.408326 -0.374522 0.131770 0.124439 0.136519 0.149151 0.141168 0.153858 0.140024 0.126044 0.132587 0.132705 0.152656 0.134959 0.125534 0.136712 0.132473 0.139161 0.156366 0.132423 0.139856 0.120400
qa: -0.6705 -0.6443 0.4258 -0.6615 -0.6410 0.5313 -0.5165 -0.5187 0.4221 -0.6457 -0.6639 -0.6616 -0.6432 0.2299 0.2186 0.2418 0.2723 0.2647 0.2833 0.2461 0.2193 0.2368 0.2318 0.2835 0.2519 0.2219 0.2413 0.2313 0.2397 0.2857 0.2295 0.2491 0.2092
va: 3.7082 3.6983 2.9362 3.7020 3.7049 2.9172 0.8041 0.8032 2.9405 3.6928 3.7110 3.7048 3.6981 0.9069 0.9095 0.9051 0.8876 0.8933 0.8876 0.8952 0.9109 0.9075 0.9072 0.8879 0.8923 0.9091 0.9057 0.9063 0.8948 0.8870 0.9089 0.9143 0.9126
dispersion: -0.022220551 hartree
energy: -1595.162851475866 hartree
dipole: 0.76705 -0.76037 0.00668 1.30314 -1.24703 0.05611 -1.72181 1.47652 -0.24529
magnitude: 0.25171 au
magnitude: 0.63981 debye
