program: Orca
programVersion: 5.0.4
elementType: C C P C C S P C C C C O H H H H H H H H H H H H H H H H H H H H
charge: 0
multiplicity: 1
keywords: Freq RIJCOSX PBEh-3c
frequency: 0.00 0.00 0.00 0.00 0.00 0.00 32.32 49.07 60.54 83.47 87.94 106.41 117.76 127.97 148.50 171.99 184.27 206.29 208.92 236.50 253.43 262.45 270.18 276.94 289.88 326.58 378.18 406.25 426.30 454.61 497.39 642.84 643.92 709.41 712.48 733.31 747.47 795.74 799.80 1018.41 1019.13 1022.55 1025.07 1034.18 1039.32 1067.50 1070.35 1081.45 1083.19 1095.60 1107.15 1112.46 1304.22 1307.81 1314.31 1319.52 1326.13 1330.89 1345.05 1347.67 1464.41 1465.14 1468.10 1474.15 1510.52 1512.96 1520.00 1522.54 1545.79 1547.82 1553.00 1555.53 1555.63 1557.07 1559.93 1560.26 3111.87 3117.95 3118.31 3120.43 3121.77 3126.37 3127.11 3134.83 3158.54 3170.06 3177.06 3185.10 3198.76 3199.94 3200.38 3201.31 3204.54 3205.29 3209.81 3232.72
frequency: 32.32 49.07 60.54 83.47 87.94 106.41 117.76 127.97 148.50 171.99 184.27 206.29 208.92 236.50 253.43 262.45 270.18 276.94 289.88 326.58 378.18 406.25 426.30 454.61 497.39 642.84 643.92 709.41 712.48 733.31 747.47 795.74 799.80 1018.41 1019.13 1022.55 1025.07 1034.18 1039.32 1067.50 1070.35 1081.45 1083.19 1095.60 1107.15 1112.46 1304.22 1307.81 1314.31 1319.52 1326.13 1330.89 1345.05 1347.67 1464.41 1465.14 1468.10 1474.15 1510.52 1512.96 1520.00 1522.54 1545.79 1547.82 1553.00 1555.53 1555.63 1557.07 1559.93 1560.26 3111.87 3117.95 3118.31 3120.43 3121.77 3126.37 3127.11 3134.83 3158.54 3170.06 3177.06 3185.10 3198.76 3199.94 3200.38 3201.31 3204.54 3205.29 3209.81 3232.72
formula: C8H20OP2S
InChI: InChI=1/C8H20OP2S/c1-5-10(6-2)12(9)11(7-3)8-4/h5-8H2,1-4H3
32 atoms
C  -3.110981 -2.013468 0.10439
C  -2.500208 -1.058918 1.117152
P  -1.48519 0.359907 0.494971
C  -2.37216 0.888803 -1.043522
C  -3.676842 1.602338 -0.70012
S  0.04848 -0.901545 -0.491177
P  1.399923 0.81729 -0.651753
C  2.013841 0.833847 1.090736
C  3.236659 1.731488 1.247183
C  2.788014 -0.002463 -1.573894
C  3.465146 -1.208201 -0.936441
O  0.511631 -1.892023 0.550715
H  -3.655393 -2.80821 0.615354
H  -3.81739 -1.514176 -0.558879
H  -2.350443 -2.491921 -0.512369
H  -3.275082 -0.617942 1.750167
H  -1.834485 -1.596044 1.797163
H  -1.701714 1.573187 -1.568625
H  -2.55557 0.046958 -1.713799
H  -4.16195 1.972844 -1.603263
H  -3.506287 2.455833 -0.043625
H  -4.383116 0.937409 -0.20124
H  2.215311 -0.183546 1.430475
H  1.191074 1.210884 1.701351
H  3.032126 2.754868 0.931148
H  4.08819 1.370697 0.669198
H  3.548298 1.766964 2.29128
H  3.520537 0.786412 -1.769357
H  2.379617 -0.262015 -2.554129
H  3.936729 -0.951625 0.0118
H  4.246924 -1.591294 -1.593371
H  2.764013 -2.015938 -0.739319
totalener: -1470.93292716 hartree
nucrepener: 1149.74384672 hartree
electener: -2620.67677387 hartree
oneelecener: -4311.34353531 hartree
twoeener: 1690.66676143 hartree
kineticenergy: 1466.03388722 hartree
exchangeener: -71.072191472627 hartree
correlationener: -5.609841289341 hartree
xcener: -76.682032761968 hartree
energy: -2440.1844 -2115.6866 -2115.6353 -529.1444 -284.4423 -284.3983 -284.3151 -284.1721 -284.1237 -283.9728 -283.8942 -283.7108 -225.9145 -185.6429 -185.6056 -168.5157 -168.4505 -168.3487 -133.7018 -133.6696 -133.6686 -133.6308 -133.6168 -133.5833 -29.8708 -24.1437 -23.9509 -23.1253 -22.9883 -21.5530 -20.0986 -19.3032 -19.1314 -19.0448 -16.6393 -15.8221 -14.5122 -14.4250 -14.1718 -13.8910 -13.4338 -13.0281 -12.8466 -12.7038 -12.5122 -12.3299 -11.9417 -11.7678 -11.7227 -11.6048 -11.3239 -11.2873 -11.0523 -10.9776 -10.9159 -9.9562 -9.7827 -8.4886 -8.1659 -7.4558 -6.7866 0.3447 0.6247 1.4575 1.8167 2.7906 3.2837 3.7896 4.1152 4.3542 4.6910 4.9668 5.0348 5.0567 5.2110 5.3151 5.3681 5.5970 5.7133 5.7446 5.9811 6.0009 6.0986 6.2685 6.3625 6.6418 6.8103 6.8862 7.1289 7.3788 7.5020 7.7726 10.8275 11.2919 11.7265 11.8166 12.4083 12.7692 12.8304 13.0243 13.1426 13.4460 13.7019 14.1071 14.3005 14.6238 15.0554 15.2199 15.5922 15.7799 16.1372 16.2865 16.5343 17.1476 17.5398 17.7360 18.3196 18.3751 18.6597 19.2916 19.4903 20.2210 20.5630 20.7731 20.9703 21.1824 21.7448 22.0652 22.3803 22.5119 22.8647 23.6238 23.9569 24.1931 24.9813 25.1801 25.6385 26.7119 26.9823 27.0478 27.2067 27.4798 27.6327 27.8314 27.9260 28.2368 28.2831 28.4002 28.7816 28.9716 29.0396 29.2173 29.6350 29.7433 30.0258 30.3961 30.5406 30.7134 30.9016 31.1825 31.6243 31.8885 32.7698 33.2757 33.6997 35.0268 35.1963 35.7342 36.1358 37.2929 40.1285 40.8453 41.0030 41.3506 43.4600 43.5702 43.7482 44.5635 45.0878 45.4500 46.1742 46.3582 52.5657 52.7708 53.8876 54.0244 54.1286 54.4992 54.7483 54.8564 55.0128 55.1184 55.1731 55.3531 55.4796 56.1949 56.2462 58.5139 58.6651 61.4618 61.7382 63.0612 63.1300 64.4101 64.5084 65.0566 65.2312 65.4927 65.6586 65.7886 65.8412 66.0242 66.1689 66.2035 66.3465 71.3911 71.4787 71.8124 72.2903 77.0919 371.7111 371.9626 372.1188 372.3827 379.2945 379.4360 379.5521 380.1010 696.2670 electronvolt
chargesum: -0.0000000
charge: -0.644078 -0.658806 0.317522 -0.649458 -0.651283 0.397217 0.304680 -0.648107 -0.652409 -0.652765 -0.645264 -0.686242 0.235646 0.213337 0.239214 0.248898 0.287026 0.267119 0.249728 0.236543 0.231247 0.221166 0.282214 0.272120 0.225502 0.218822 0.238435 0.247442 0.253070 0.220151 0.223335 0.257979
charge: -0.373116 -0.409659 0.281111 -0.405427 -0.370631 0.508234 0.259316 -0.399852 -0.370219 -0.406127 -0.377134 -0.658288 0.134611 0.122765 0.133532 0.140254 0.158367 0.144294 0.132549 0.134096 0.132799 0.126080 0.147868 0.146912 0.129352 0.124511 0.134912 0.138891 0.141115 0.127210 0.128556 0.143118
qa: -0.6441 -0.6588 0.3175 -0.6495 -0.6513 0.3972 0.3047 -0.6481 -0.6524 -0.6528 -0.6453 -0.6862 0.2356 0.2133 0.2392 0.2489 0.2870 0.2671 0.2497 0.2365 0.2312 0.2212 0.2822 0.2721 0.2255 0.2188 0.2384 0.2474 0.2531 0.2202 0.2233 0.2580
va: 3.7073 3.6845 2.9321 3.6839 3.7171 3.1549 2.9658 3.6694 3.7207 3.7106 3.6916 1.7462 0.9064 0.9111 0.9059 0.8961 0.8862 0.8878 0.8929 0.9069 0.9073 0.9092 0.8883 0.8883 0.9077 0.9104 0.9060 0.8939 0.8921 0.9115 0.9082 0.9102
dispersion: -0.021864448 hartree
energy: -1470.914225074645 hartree
dipole: -0.58373 0.23496 -0.34877 0.68002 0.02416 0.70418 0.23996 -0.71426 -0.47430
magnitude: 0.91787 au
magnitude: 2.33303 debye
temp: 298.15 k
press: 1.00 atm
zeropoint: 0.28139037 hartree
thermalvibcorrection: 0.01506156 hartree
thermalrotcorrection: 0.00141627 hartree
thermaltrasncorrection: 0.00141627 hartree
thermaltotal: -1470.61494060 hartree
thermalcorr: 0.01789410 hartree
nonthermalcorr: 0.28139037 hartree
totalcorr: 0.29928447 hartree
thermalcorrenthalpy: 0.00094421 hartree
totalenthalpy: -1470.61399640 hartree
vibrat: 0.02714793 hartree
rotat: 0.01530487 hartree
transl: 0.02002762 hartree
total: 0.06248042 hartree
totalentropycorr: -0.06248042 hartree
gibbsenthalpy: -1470.67647682 hartree
gibbsminuselec: 0.23774826 hartree
