program: Orca
programVersion: 5.0.4
elementType: C S F C H H H H H H
charge: 1
multiplicity: 1
keywords: Freq RIJCOSX PBEh-3c
frequency: 0.00 0.00 0.00 0.00 0.00 0.00 177.96 217.75 279.43 312.81 356.26 688.33 737.64 920.03 975.66 1012.37 1059.59 1103.69 1414.00 1435.64 1467.36 1480.13 1485.07 1503.26 3119.97 3122.20 3227.99 3231.33 3255.82 3256.80
frequency: 177.96 217.75 279.43 312.81 356.26 688.33 737.64 920.03 975.66 1012.37 1059.59 1103.69 1414.00 1435.64 1467.36 1480.13 1485.07 1503.26 3119.97 3122.20 3227.99 3231.33 3255.82 3256.80
formula: C2H6FS
InChI: InChI=1/C2H6FS/c1-4(2)3/h1-2H3
10 atoms
C  -1.384893 -0.242152 0.038761
S  -0.078429 0.886095 -0.400824
F  -0.009564 1.761628 0.91759
C  1.387986 -0.110203 -0.222551
H  -2.306678 0.332216 0.126574
H  -1.490759 -0.95022 -0.785101
H  -1.155357 -0.762517 0.966872
H  1.397212 -0.629273 0.734271
H  2.255516 0.540186 -0.328478
H  1.385066 -0.82596 -1.047312
totalener: -576.74133072 hartree
nucrepener: 191.55946021 hartree
electener: -768.30079094 hartree
oneelecener: -1164.44438043 hartree
twoeener: 396.14358950 hartree
kineticenergy: 574.93181376 hartree
exchangeener: -26.468349126991 hartree
correlationener: -1.962598313003 hartree
xcener: -28.430947439993 hartree
energy: -2448.4402 -690.2065 -290.9968 -290.9845 -234.1516 -176.8266 -176.6535 -176.5168 -43.4342 -32.0540 -28.3990 -25.8869 -22.2713 -21.7200 -21.6831 -19.8625 -19.4407 -19.2223 -18.8229 -18.0543 -16.4112 -6.5805 -4.3681 -3.0782 -1.6630 -1.1611 -0.2844 -0.1929 0.3520 0.8657 5.8434 6.3008 6.4018 7.6336 7.6679 8.4384 10.8316 12.3015 12.3478 12.7338 13.7250 13.7832 15.9149 19.9486 20.9924 21.2608 21.5539 22.3546 22.8134 22.8736 24.4298 27.3166 27.4934 28.2198 29.1168 29.2344 29.4281 31.3735 36.0474 36.7758 40.4175 41.1820 43.0160 44.0493 46.5907 52.5462 54.9981 55.3879 56.0474 56.5657 56.8423 71.2782 365.5738 367.8915 883.6483 electronvolt
chargesum: 1.0000000
charge: -0.802304 0.926205 -0.352785 -0.803296 0.354992 0.326587 0.333937 0.335015 0.355330 0.326320
charge: -0.452874 1.043793 -0.286006 -0.453178 0.197170 0.191046 0.185541 0.186088 0.196991 0.191429
qa: -0.8023 0.9262 -0.3528 -0.8033 0.3550 0.3266 0.3339 0.3350 0.3553 0.3263
va: 3.5529 2.9135 0.9869 3.5519 0.8498 0.8610 0.8591 0.8586 0.8497 0.8609
dispersion: -0.003715644 hartree
energy: -576.730289955299 hartree
dipole: 0.23912 -0.22026 0.01886 -6.99890 5.77349 -1.22540 -1.26859 0.73872 -0.52987
magnitude: 1.33519 au
magnitude: 3.39379 debye
temp: 298.15 k
press: 1.00 atm
zeropoint: 0.08165204 hartree
thermalvibcorrection: 0.00276476 hartree
thermalrotcorrection: 0.00141627 hartree
thermaltrasncorrection: 0.00141627 hartree
thermaltotal: -576.64304061 hartree
thermalcorr: 0.00559730 hartree
nonthermalcorr: 0.08165204 hartree
totalcorr: 0.08724934 hartree
thermalcorrenthalpy: 0.00094421 hartree
totalenthalpy: -576.64209640 hartree
vibrat: 0.00450654 hartree
rotat: 0.01189153 hartree
transl: 0.01857504 hartree
total: 0.03497311 hartree
totalentropycorr: -0.03497311 hartree
gibbsenthalpy: -576.67706951 hartree
gibbsminuselec: 0.05322044 hartree
