program: Orca
programVersion: 5.0.4
elementType: C S C O H H H H H H
charge: 0
multiplicity: 1
keywords: SP DSD-BLYP D3BJ def2-QZVPP def2-QZVPP/C def2/J TightSCF
formula: C2H6OS
InChI: InChI=1/C2H6OS/c1-4(2)3/h1-2H3
10 atoms
C  -1.290346 0.36488 0.917582
S  0.027016 0.29868 -0.330534
C  1.390454 0.05064 0.843298
O  -0.149688 -0.981037 -1.077672
H  -2.237109 0.41857 0.383248
H  -1.179795 1.247397 1.545795
H  -1.271824 -0.541068 1.522484
H  1.19275 -0.81974 1.468354
H  1.527428 0.938684 1.458936
H  2.292285 -0.124588 0.259756
totalener: -552.50361229 hartree
nucrepener: 183.61514731 hartree
electener: -736.11875960 hartree
oneelecener: -1124.05046412 hartree
twoeener: 387.93170452 hartree
kineticenergy: 551.69658370 hartree
exchangeener: -14.213424555790 hartree
correlationener: -0.821631017623 hartree
xcener: -15.035055573413 hartree
chargesum: 0.0000000
charge: -0.222561 0.531505 -0.222805 -0.618473 0.091627 0.072937 0.101808 0.098073 0.076024 0.091865
charge: 0.095789 0.489561 0.095414 -0.185461 -0.081011 -0.084957 -0.081789 -0.081840 -0.084596 -0.081109
qa: -0.2226 0.5315 -0.2228 -0.6185 0.0916 0.0729 0.1018 0.0981 0.0760 0.0919
va: 3.8208 3.6177 3.8210 1.7887 1.0074 1.0104 1.0032 1.0037 1.0103 1.0074
total: -552.919969243 hartree
dispersion: -0.005131336 hartree
energy: -552.925100578677 hartree
dipole: 0.30073 -0.14280 0.15792 1.02697 -0.06456 0.96241 6.22157 -4.79262 1.42895
magnitude: 1.73005 au
magnitude: 4.39743 debye
