program: Orca
programVersion: 5.0.4
elementType: F S P C C C C C C C C C C C C P C C C C C C H H H H H H H H H H H H H H H H
charge: 1
multiplicity: 1
keywords: Opt RIJCOSX PBEh-3c
formula: C18H16FP2S
InChI: InChI=1/C18H16FP2S/c19-22(20-16-10-4-1-5-11-16)21(17-12-6-2-7-13-17)18-14-8-3-9-15-18/h1-15,20H
38 atoms
F  0.615924 0.931123 0.881993
S  0.679575 0.884351 -0.730004
P  -1.319512 0.393093 -1.507947
C  -2.234403 1.708445 -0.664351
C  -1.900181 3.03183 -0.961172
C  -2.645695 4.068751 -0.431233
C  -3.748925 3.794545 0.367376
C  -4.104937 2.482315 0.633265
C  -3.351766 1.435637 0.121836
C  -1.635728 -1.154801 -0.637039
C  -1.696653 -1.285617 0.754844
C  -1.885172 -2.534924 1.317641
C  -2.015299 -3.656465 0.504909
C  -1.95728 -3.532908 -0.87414
C  -1.76218 -2.284892 -1.447365
P  1.74228 -0.9658 -1.195522
C  3.294395 -0.585773 -0.368471
C  4.356707 -0.162576 -1.169611
C  5.58411 0.117891 -0.593471
C  5.756637 -0.035128 0.774668
C  4.70561 -0.468086 1.573584
C  3.473106 -0.740256 1.007923
H  -1.06268 3.26209 -1.610169
H  -2.375692 5.091949 -0.652998
H  -4.337318 4.606948 0.77145
H  -4.974586 2.266925 1.238702
H  -3.653716 0.417506 0.325779
H  -1.610208 -0.418499 1.395658
H  -1.934716 -2.638008 2.393116
H  -2.166821 -4.629496 0.952437
H  -2.065051 -4.404198 -1.505187
H  -1.7136 -2.19011 -2.525539
H  1.079003 -1.693176 -0.182013
H  4.230433 -0.060308 -2.240668
H  6.407802 0.445007 -1.212559
H  6.718416 0.176755 1.221803
H  4.84884 -0.592626 2.638014
H  2.659281 -1.081413 1.634462
totalener: -1873.06283440 hartree
nucrepener: 2148.46626690 hartree
electener: -4021.52910130 hartree
oneelecener: -6822.31850170 hartree
twoeener: 2800.78940040 hartree
kineticenergy: 1865.33175498 hartree
exchangeener: -100.113556817135 hartree
correlationener: -8.128684042490 hartree
xcener: -108.242240859625 hartree
dispersion: -0.032025974 hartree
dispersion: -0.031991036 hartree
dispersion: -0.032030799 hartree
dispersion: -0.032007125 hartree
dispersion: -0.032045570 hartree
dispersion: -0.032010014 hartree
dispersion: -0.032011896 hartree
dispersion: -0.032039014 hartree
dispersion: -0.032020642 hartree
chargesum: 1.0000000
charge: -0.380335 0.499377 0.512370 -0.207682 -0.242671 -0.193595 -0.218366 -0.194892 -0.243684 -0.273925 -0.242761 -0.205312 -0.215380 -0.203664 -0.237333 0.234440 -0.212424 -0.238423 -0.197232 -0.213362 -0.198285 -0.206995 0.240776 0.259131 0.261883 0.257663 0.268281 0.278408 0.261826 0.267159 0.264873 0.266691 0.169083 0.255506 0.261282 0.265059 0.259246 0.243266
charge: -0.338010 0.628846 0.455452 -0.228814 -0.128594 -0.111304 -0.094615 -0.114340 -0.122661 -0.248344 -0.131233 -0.121130 -0.089149 -0.118990 -0.116620 0.290110 -0.248415 -0.112648 -0.115937 -0.085525 -0.116155 -0.116464 0.144376 0.154980 0.155781 0.154436 0.154005 0.154439 0.155414 0.157605 0.157649 0.155747 0.074312 0.151538 0.156260 0.156891 0.155121 0.145988
qa: -0.3803 0.4994 0.5124 -0.2077 -0.2427 -0.1936 -0.2184 -0.1949 -0.2437 -0.2739 -0.2428 -0.2053 -0.2154 -0.2037 -0.2373 0.2344 -0.2124 -0.2384 -0.1972 -0.2134 -0.1983 -0.2070 0.2408 0.2591 0.2619 0.2577 0.2683 0.2784 0.2618 0.2672 0.2649 0.2667 0.1691 0.2555 0.2613 0.2651 0.2592 0.2433
va: 0.9493 2.6643 3.0133 3.7152 3.7870 3.8248 3.7940 3.8135 3.8133 3.7575 3.7677 3.8032 3.7858 3.7988 3.7859 2.9584 3.7111 3.7966 3.8076 3.7879 3.8056 3.8008 0.9097 0.8966 0.8958 0.8972 0.8924 0.8923 0.8960 0.8938 0.8946 0.8986 0.9492 0.9034 0.8959 0.8946 0.8968 0.9066
dispersion: -0.032019484 hartree
energy: -1873.044647248435 hartree
dipole: -1.82419 2.18071 0.35652 -2.76658 2.37683 -0.38975 7.25357 -6.95660 0.29698
magnitude: 0.60598 au
magnitude: 1.54027 debye
