program: Orca
programVersion: 5.0.4
elementType: O S P C C C C C C C C C C C C P C C C C C C H H H H H H H H H H H H H H H H
charge: 0
multiplicity: 1
keywords: Freq RIJCOSX PBEh-3c
frequency: 0.00 0.00 0.00 0.00 0.00 0.00 19.27 33.53 40.93 53.89 66.32 78.57 89.92 112.75 122.39 135.07 201.39 209.52 220.03 229.34 248.25 276.85 323.36 356.44 387.47 406.78 416.51 418.42 430.67 433.80 453.13 471.32 500.41 506.08 529.57 642.62 643.13 644.66 719.55 726.85 731.28 732.66 735.43 740.40 775.35 781.69 787.52 808.47 889.46 890.67 893.76 936.62 964.13 971.35 972.43 1024.06 1024.25 1027.20 1041.54 1043.75 1044.16 1051.59 1053.24 1054.12 1083.59 1084.28 1085.34 1121.78 1140.07 1141.72 1145.21 1154.12 1158.83 1161.26 1216.32 1216.91 1217.19 1248.12 1249.51 1251.94 1359.90 1370.62 1372.40 1403.89 1404.10 1404.88 1517.04 1521.97 1523.04 1569.72 1570.34 1571.88 1691.11 1692.90 1694.62 1710.42 1711.60 1712.45 2479.34 3250.78 3256.82 3262.42 3266.27 3266.63 3270.09 3274.91 3278.92 3279.77 3282.48 3287.56 3289.11 3291.48 3305.54 3310.50
frequency: 19.27 33.53 40.93 53.89 66.32 78.57 89.92 112.75 122.39 135.07 201.39 209.52 220.03 229.34 248.25 276.85 323.36 356.44 387.47 406.78 416.51 418.42 430.67 433.80 453.13 471.32 500.41 506.08 529.57 642.62 643.13 644.66 719.55 726.85 731.28 732.66 735.43 740.40 775.35 781.69 787.52 808.47 889.46 890.67 893.76 936.62 964.13 971.35 972.43 1024.06 1024.25 1027.20 1041.54 1043.75 1044.16 1051.59 1053.24 1054.12 1083.59 1084.28 1085.34 1121.78 1140.07 1141.72 1145.21 1154.12 1158.83 1161.26 1216.32 1216.91 1217.19 1248.12 1249.51 1251.94 1359.90 1370.62 1372.40 1403.89 1404.10 1404.88 1517.04 1521.97 1523.04 1569.72 1570.34 1571.88 1691.11 1692.90 1694.62 1710.42 1711.60 1712.45 2479.34 3250.78 3256.82 3262.42 3266.27 3266.63 3270.09 3274.91 3278.92 3279.77 3282.48 3287.56 3289.11 3291.48 3305.54 3310.50
formula: C18H16OP2S
InChI: InChI=1/C18H16OP2S/c19-22(20-16-10-4-1-5-11-16)21(17-12-6-2-7-13-17)18-14-8-3-9-15-18/h1-15,20H
38 atoms
O  0.349168 -1.778521 -1.85768
S  0.464236 -2.33834 -0.470405
P  -0.341679 -0.942512 1.083335
C  -0.385161 0.592283 0.119505
C  -0.993553 0.70889 -1.132385
C  -0.960749 1.918731 -1.806411
C  -0.326263 3.017313 -1.243891
C  0.27878 2.909007 -0.001233
C  0.251556 1.700547 0.675365
C  -2.055971 -1.574077 1.00102
C  -2.267661 -2.922593 1.291993
C  -3.550184 -3.441393 1.344521
C  -4.644462 -2.616337 1.126187
C  -4.444848 -1.270858 0.860418
C  -3.160245 -0.749671 0.79918
P  2.535669 -2.209751 0.271275
C  2.956789 -0.467209 -0.041749
C  3.429811 0.27512 1.039307
C  3.793068 1.603367 0.873384
C  3.671785 2.201188 -0.371381
C  3.186955 1.472132 -1.448794
C  2.834982 0.142271 -1.291942
H  -1.494479 -0.137568 -1.577744
H  -1.43239 2.001858 -2.776607
H  -0.306972 3.959983 -1.775573
H  0.77614 3.762015 0.440606
H  0.73315 1.615746 1.641059
H  -1.425789 -3.578992 1.479532
H  -3.695233 -4.491734 1.560168
H  -5.647179 -3.020307 1.168777
H  -5.292801 -0.619087 0.695936
H  -3.02472 0.303495 0.591056
H  3.009554 -2.765496 -0.940932
H  3.522685 -0.191007 2.012866
H  4.172276 2.168183 1.715013
H  3.953899 3.23764 -0.504341
H  3.078501 1.942612 -2.416746
H  2.451537 -0.417229 -2.132888
totalener: -1848.70535123 hartree
nucrepener: 2217.72100573 hartree
electener: -4066.42635696 hartree
oneelecener: -6949.74297608 hartree
twoeener: 2883.31661912 hartree
kineticenergy: 1841.07901247 hartree
exchangeener: -99.246201151072 hartree
correlationener: -8.122469303150 hartree
xcener: -107.368670454222 hartree
chargesum: 0.0000000
charge: -0.648242 0.442830 0.358675 -0.196730 -0.194273 -0.215455 -0.228096 -0.198895 -0.240006 -0.164265 -0.249126 -0.197101 -0.234301 -0.196774 -0.256992 0.116035 -0.197654 -0.252463 -0.212165 -0.226212 -0.191624 -0.213980 0.264621 0.224365 0.221564 0.219319 0.233980 0.225572 0.224498 0.224277 0.223506 0.249625 0.109049 0.235829 0.222618 0.223650 0.225414 0.268924
charge: -0.619096 0.528812 0.331138 -0.210321 -0.109317 -0.139040 -0.120416 -0.136849 -0.115155 -0.204184 -0.136896 -0.129488 -0.129217 -0.130585 -0.132859 0.150566 -0.221045 -0.131957 -0.142681 -0.119641 -0.125459 -0.113881 0.153870 0.138772 0.136410 0.136702 0.142656 0.137023 0.138861 0.138090 0.138396 0.147411 0.038342 0.141896 0.137227 0.136597 0.139837 0.155483
qa: -0.6482 0.4428 0.3587 -0.1967 -0.1943 -0.2155 -0.2281 -0.1989 -0.2400 -0.1643 -0.2491 -0.1971 -0.2343 -0.1968 -0.2570 0.1160 -0.1977 -0.2525 -0.2122 -0.2262 -0.1916 -0.2140 0.2646 0.2244 0.2216 0.2193 0.2340 0.2256 0.2245 0.2243 0.2235 0.2496 0.1090 0.2358 0.2226 0.2237 0.2254 0.2689
va: 1.8136 3.1958 2.9558 3.7653 3.7809 3.8264 3.8209 3.8231 3.8331 3.7143 3.8106 3.8343 3.8206 3.8230 3.8296 2.9438 3.7496 3.8231 3.8203 3.8208 3.8132 3.7867 0.9093 0.9098 0.9105 0.9127 0.9171 0.9171 0.9091 0.9099 0.9096 0.9049 0.9566 0.9123 0.9101 0.9098 0.9103 0.9077
dispersion: -0.035641589 hartree
energy: -1848.690007189523 hartree
dipole: -4.83436 4.70077 -0.13359 12.38510 -11.46982 0.91528 -2.68272 3.01652 0.33380
magnitude: 0.98336 au
magnitude: 2.49951 debye
temp: 298.15 k
press: 1.00 atm
zeropoint: 0.29902234 hartree
thermalvibcorrection: 0.01698076 hartree
thermalrotcorrection: 0.00141627 hartree
thermaltrasncorrection: 0.00141627 hartree
thermaltotal: -1848.37117155 hartree
thermalcorr: 0.01981330 hartree
nonthermalcorr: 0.29902234 hartree
totalcorr: 0.31883564 hartree
thermalcorrenthalpy: 0.00094421 hartree
totalenthalpy: -1848.37022734 hartree
vibrat: 0.03013322 hartree
rotat: 0.01645155 hartree
transl: 0.02061413 hartree
total: 0.06719890 hartree
totalentropycorr: -0.06719890 hartree
gibbsenthalpy: -1848.43742623 hartree
gibbsminuselec: 0.25258096 hartree
