program: Orca
programVersion: 5.0.4
elementType: O S P C C C C C C C C C C C C P C C C C C C H H H H H H H H H H H H H H H H
charge: 0
multiplicity: 1
keywords: SP DSD-BLYP D3BJ def2-QZVPP def2-QZVPP/C def2/J TightSCF
formula: C18H16OP2S
InChI: InChI=1/C18H16OP2S/c19-22(20-16-10-4-1-5-11-16)21(17-12-6-2-7-13-17)18-14-8-3-9-15-18/h1-15,20H
38 atoms
O  0.176378 -1.325015 -1.909857
S  0.291446 -1.884833 -0.522583
P  -0.514469 -0.489006 1.031157
C  -0.557951 1.045789 0.067328
C  -1.166343 1.162397 -1.184562
C  -1.133539 2.372237 -1.858589
C  -0.499054 3.47082 -1.296068
C  0.10599 3.362514 -0.05341
C  0.078766 2.154053 0.623187
C  -2.228762 -1.12057 0.948842
C  -2.440451 -2.469086 1.239815
C  -3.722974 -2.987887 1.292344
C  -4.817252 -2.162831 1.074009
C  -4.617638 -0.817351 0.808241
C  -3.333036 -0.296165 0.747003
P  2.362879 -1.756245 0.219097
C  2.783998 -0.013703 -0.093927
C  3.257021 0.728626 0.987129
C  3.620278 2.056874 0.821207
C  3.498994 2.654695 -0.423559
C  3.014164 1.925639 -1.500972
C  2.662192 0.595778 -1.34412
H  -1.667269 0.315938 -1.629922
H  -1.60518 2.455364 -2.828785
H  -0.479763 4.41349 -1.82775
H  0.603349 4.215522 0.388429
H  0.56036 2.069252 1.588882
H  -1.59858 -3.125486 1.427354
H  -3.868023 -4.038228 1.50799
H  -5.819969 -2.566801 1.116599
H  -5.465591 -0.16558 0.643758
H  -3.19751 0.757002 0.538879
H  2.836764 -2.311989 -0.99311
H  3.349895 0.262499 1.960688
H  3.999485 2.621689 1.662835
H  3.781109 3.691146 -0.556519
H  2.905711 2.396118 -2.468924
H  2.278747 0.036277 -2.185066
totalener: -1848.59214232 hartree
nucrepener: 2217.72100632 hartree
electener: -4066.31314864 hartree
oneelecener: -6950.16065952 hartree
twoeener: 2883.84751088 hartree
kineticenergy: 1845.75685674 hartree
exchangeener: -55.176165187946 hartree
correlationener: -3.433884894840 hartree
xcener: -58.610050082786 hartree
chargesum: 0.0000000
charge: -0.608133 0.326937 0.104701 0.154853 -0.063985 -0.117500 -0.116453 -0.143148 -0.059865 0.032604 -0.070796 -0.131375 -0.091312 -0.133341 -0.089935 0.105797 -0.033099 -0.077103 -0.124910 -0.092305 -0.102325 -0.068871 0.074125 0.100096 0.091207 0.097573 0.093223 0.073017 0.092812 0.091804 0.094847 0.092976 -0.004177 0.101367 0.095107 0.097983 0.095846 0.111757
charge: -0.199940 0.232586 0.471551 -0.260190 0.061116 0.069253 0.073044 0.065890 0.041424 -0.259194 0.031390 0.066977 0.069582 0.067384 0.052526 0.417489 -0.293084 0.030633 0.061730 0.073527 0.075176 0.065021 -0.052545 -0.059203 -0.058548 -0.060595 -0.055393 -0.061247 -0.058566 -0.059292 -0.059099 -0.054445 -0.143522 -0.057952 -0.061538 -0.058611 -0.057748 -0.055585
qa: -0.6081 0.3269 0.1047 0.1549 -0.0640 -0.1175 -0.1165 -0.1431 -0.0599 0.0326 -0.0708 -0.1314 -0.0913 -0.1333 -0.0899 0.1058 -0.0331 -0.0771 -0.1249 -0.0923 -0.1023 -0.0689 0.0741 0.1001 0.0912 0.0976 0.0932 0.0730 0.0928 0.0918 0.0948 0.0930 -0.0042 0.1014 0.0951 0.0980 0.0958 0.1118
va: 1.7891 3.4625 3.0543 3.5086 3.6847 3.8173 3.8308 3.7936 3.6507 3.5769 3.7238 3.8171 3.8261 3.8213 3.6925 3.0690 3.6873 3.6951 3.8046 3.8202 3.8048 3.7009 1.0380 0.9842 0.9861 0.9823 1.0050 1.0079 0.9864 0.9853 0.9841 1.0066 1.0050 0.9982 0.9878 0.9830 0.9880 1.0132
total: -1850.479944722 hartree
dispersion: -0.047894265 hartree
energy: -1850.527838986501 hartree
dipole: -4.83436 4.76654 -0.06782 12.38510 -11.44432 0.94078 -2.68272 3.18057 0.49785
magnitude: 1.06654 au
magnitude: 2.71093 debye
