program: Orca
programVersion: 5.0.4
elementType: C P S P C C C C C C C C C C C C C C C C C H H H H H H H H H H H H H H H H
charge: 2
multiplicity: 1
keywords: Freq RIJCOSX PBEh-3c
frequency: 0.00 0.00 0.00 0.00 0.00 0.00 15.77 23.14 35.46 53.03 55.55 67.80 71.78 86.48 109.45 128.10 170.20 182.95 228.50 265.57 279.14 288.21 308.37 359.19 399.75 404.85 410.73 426.10 445.99 451.44 470.02 511.42 623.91 626.32 632.56 663.62 681.88 692.16 701.67 746.51 769.30 784.92 790.79 794.19 797.10 803.16 879.25 886.96 888.19 935.93 999.06 1004.90 1012.27 1029.59 1032.63 1039.22 1047.02 1049.78 1053.39 1071.27 1072.45 1075.09 1077.94 1079.09 1079.58 1151.42 1154.07 1154.72 1160.48 1167.24 1168.67 1232.67 1237.75 1238.35 1253.28 1258.61 1262.65 1368.12 1379.35 1380.70 1425.68 1431.33 1435.47 1519.17 1523.77 1524.62 1545.92 1548.64 1555.86 1650.65 1656.50 1665.18 1678.98 1687.27 1694.40 2503.21 3263.82 3274.97 3275.45 3281.71 3283.88 3285.32 3289.62 3292.29 3293.07 3301.82 3303.92 3305.34 3306.78 3308.11 3309.39
frequency: 15.77 23.14 35.46 53.03 55.55 67.80 71.78 86.48 109.45 128.10 170.20 182.95 228.50 265.57 279.14 288.21 308.37 359.19 399.75 404.85 410.73 426.10 445.99 451.44 470.02 511.42 623.91 626.32 632.56 663.62 681.88 692.16 701.67 746.51 769.30 784.92 790.79 794.19 797.10 803.16 879.25 886.96 888.19 935.93 999.06 1004.90 1012.27 1029.59 1032.63 1039.22 1047.02 1049.78 1053.39 1071.27 1072.45 1075.09 1077.94 1079.09 1079.58 1151.42 1154.07 1154.72 1160.48 1167.24 1168.67 1232.67 1237.75 1238.35 1253.28 1258.61 1262.65 1368.12 1379.35 1380.70 1425.68 1431.33 1435.47 1519.17 1523.77 1524.62 1545.92 1548.64 1555.86 1650.65 1656.50 1665.18 1678.98 1687.27 1694.40 2503.21 3263.82 3274.97 3275.45 3281.71 3283.88 3285.32 3289.62 3292.29 3293.07 3301.82 3303.92 3305.34 3306.78 3308.11 3309.39
formula: C18H16P2S
InChI: InChI=1/C12H10PS.C6H6P/c14-13(11-7-3-1-4-8-11)12-9-5-2-6-10-12;7-6-4-2-1-3-5-6/h1-10H;1-5,7H
37 atoms
C  3.516508 0.197559 0.065767
P  2.206758 -0.863552 -0.443451
S  0.625517 0.870286 -1.023055
P  -1.101559 0.112858 -0.530889
C  -1.417345 -1.57627 -0.707423
C  -2.283565 -2.225565 0.198949
C  -2.494451 -3.579665 0.063703
C  -1.866112 -4.283999 -0.96244
C  -1.009137 -3.645114 -1.858113
C  -0.768006 -2.295839 -1.732819
C  -2.326839 1.162018 0.073822
C  -3.687136 0.80315 -0.077615
C  -4.657226 1.674861 0.35921
C  -4.292896 2.890687 0.938277
C  -2.952175 3.252382 1.078944
C  -1.963177 2.402692 0.643467
C  4.458716 0.742049 -0.827125
C  5.51822 1.475235 -0.339323
C  5.646326 1.679491 1.033675
C  4.720287 1.14995 1.92779
C  3.659354 0.409026 1.451271
H  2.536856 -0.97221 -1.81392
H  -2.75104 -1.685367 1.012067
H  -3.141136 -4.095916 0.759382
H  -2.046136 -5.3461 -1.065321
H  -0.542743 -4.205671 -2.656131
H  -0.128945 -1.792696 -2.447665
H  -3.973091 -0.122244 -0.560262
H  -5.701487 1.423111 0.238044
H  -5.064443 3.569021 1.278377
H  -2.690163 4.198928 1.530352
H  -0.923176 2.680193 0.755546
H  4.364139 0.577933 -1.893063
H  6.25224 1.885747 -1.018518
H  6.483394 2.252298 1.410273
H  4.841025 1.306328 2.990495
H  2.952344 -0.025696 2.147923
totalener: -1773.04107901 hartree
nucrepener: 1893.65391560 hartree
electener: -3666.69499461 hartree
oneelecener: -6153.19097060 hartree
twoeener: 2486.49597599 hartree
kineticenergy: 1765.94126706 hartree
exchangeener: -94.304280449540 hartree
correlationener: -7.646469164241 hartree
xcener: -101.950749613781 hartree
chargesum: 2.0000000
charge: -0.215265 0.287008 -0.049623 0.719287 -0.168950 -0.230157 -0.192856 -0.178247 -0.194027 -0.214659 -0.163870 -0.230029 -0.189300 -0.175754 -0.188592 -0.204133 -0.200369 -0.189482 -0.196008 -0.192427 -0.224565 0.149990 0.299182 0.309160 0.317255 0.306779 0.283421 0.298411 0.309401 0.318894 0.309098 0.286770 0.264750 0.290873 0.298538 0.286562 0.262932
charge: -0.258233 0.370895 0.065344 0.803443 -0.235063 -0.082196 -0.095608 -0.016180 -0.095477 -0.084414 -0.229908 -0.078365 -0.096686 -0.008069 -0.094161 -0.070824 -0.091618 -0.104463 -0.037972 -0.110367 -0.090487 0.064491 0.169385 0.179548 0.182313 0.178501 0.162584 0.169863 0.179837 0.183004 0.179695 0.168479 0.156320 0.170201 0.172520 0.168303 0.155366
qa: -0.2153 0.2870 -0.0496 0.7193 -0.1689 -0.2302 -0.1929 -0.1782 -0.1940 -0.2147 -0.1639 -0.2300 -0.1893 -0.1758 -0.1886 -0.2041 -0.2004 -0.1895 -0.1960 -0.1924 -0.2246 0.1500 0.2992 0.3092 0.3173 0.3068 0.2834 0.2984 0.3094 0.3189 0.3091 0.2868 0.2648 0.2909 0.2985 0.2866 0.2629
va: 3.6959 2.8267 2.4177 4.1412 3.6507 3.7545 3.7756 3.7228 3.7827 3.7612 3.6587 3.7542 3.7741 3.7149 3.7683 3.7553 3.7765 3.7761 3.7486 3.7867 3.7765 0.9501 0.8776 0.8747 0.8697 0.8761 0.8892 0.8777 0.8745 0.8688 0.8745 0.8896 0.8977 0.8832 0.8792 0.8850 0.8997
dispersion: -0.029720063 hartree
energy: -1773.024257504379 hartree
dipole: -1.71316 0.11223 -1.60093 0.02837 -0.30273 -0.27436 3.39981 -3.24389 0.15591
magnitude: 1.63173 au
magnitude: 4.14753 debye
temp: 298.15 k
press: 1.00 atm
zeropoint: 0.29538926 hartree
thermalvibcorrection: 0.01654194 hartree
thermalrotcorrection: 0.00141627 hartree
thermaltrasncorrection: 0.00141627 hartree
thermaltotal: -1772.70949376 hartree
thermalcorr: 0.01937448 hartree
nonthermalcorr: 0.29538926 hartree
totalcorr: 0.31476374 hartree
thermalcorrenthalpy: 0.00094421 hartree
totalenthalpy: -1772.70854955 hartree
vibrat: 0.02992801 hartree
rotat: 0.01678252 hartree
transl: 0.02054634 hartree
total: 0.06725687 hartree
totalentropycorr: -0.06725687 hartree
gibbsenthalpy: -1772.77580642 hartree
gibbsminuselec: 0.24845109 hartree
