program: Orca
programVersion: 5.0.4
elementType: O S P C C C C C C C C C C C C P C C C C C C C C C C C C H H H H H H H H H H H H H H H H H H H H
charge: 0
multiplicity: 1
keywords: Freq RIJCOSX PBEh-3c
frequency: 0.00 0.00 0.00 0.00 0.00 0.00 24.10 28.97 33.69 35.80 43.22 58.33 68.79 82.19 86.43 90.46 104.68 116.81 126.70 199.57 208.72 216.08 220.82 224.59 249.62 268.08 276.80 284.93 305.31 415.44 417.62 421.90 423.94 426.70 432.07 433.42 453.89 467.26 471.57 504.45 524.41 528.40 544.24 643.49 643.82 644.36 644.58 719.47 722.34 730.12 731.66 734.88 735.73 738.54 739.15 779.89 784.37 788.88 791.64 887.01 894.56 896.79 898.42 958.80 971.58 973.33 977.03 1021.29 1028.35 1029.72 1031.41 1041.57 1042.39 1043.87 1044.40 1051.08 1054.32 1054.97 1055.33 1083.41 1083.99 1085.54 1085.94 1123.90 1138.86 1139.32 1144.41 1145.19 1154.60 1156.28 1158.95 1160.14 1216.42 1216.94 1216.98 1217.31 1246.65 1247.96 1252.43 1255.34 1359.03 1362.08 1369.84 1371.17 1402.10 1402.92 1406.38 1409.90 1517.19 1517.59 1522.00 1523.13 1569.11 1570.27 1571.66 1573.73 1690.41 1691.37 1693.95 1694.68 1710.68 1711.33 1712.14 1712.58 3260.62 3261.73 3262.11 3263.19 3265.39 3266.91 3268.18 3271.56 3272.03 3272.55 3274.61 3278.62 3280.62 3281.46 3283.25 3285.28 3289.13 3290.24 3291.77 3292.34
frequency: 24.10 28.97 33.69 35.80 43.22 58.33 68.79 82.19 86.43 90.46 104.68 116.81 126.70 199.57 208.72 216.08 220.82 224.59 249.62 268.08 276.80 284.93 305.31 415.44 417.62 421.90 423.94 426.70 432.07 433.42 453.89 467.26 471.57 504.45 524.41 528.40 544.24 643.49 643.82 644.36 644.58 719.47 722.34 730.12 731.66 734.88 735.73 738.54 739.15 779.89 784.37 788.88 791.64 887.01 894.56 896.79 898.42 958.80 971.58 973.33 977.03 1021.29 1028.35 1029.72 1031.41 1041.57 1042.39 1043.87 1044.40 1051.08 1054.32 1054.97 1055.33 1083.41 1083.99 1085.54 1085.94 1123.90 1138.86 1139.32 1144.41 1145.19 1154.60 1156.28 1158.95 1160.14 1216.42 1216.94 1216.98 1217.31 1246.65 1247.96 1252.43 1255.34 1359.03 1362.08 1369.84 1371.17 1402.10 1402.92 1406.38 1409.90 1517.19 1517.59 1522.00 1523.13 1569.11 1570.27 1571.66 1573.73 1690.41 1691.37 1693.95 1694.68 1710.68 1711.33 1712.14 1712.58 3260.62 3261.73 3262.11 3263.19 3265.39 3266.91 3268.18 3271.56 3272.03 3272.55 3274.61 3278.62 3280.62 3281.46 3283.25 3285.28 3289.13 3290.24 3291.77 3292.34
formula: C24H20OP2S
InChI: InChI=1/C24H20OP2S/c25-28(26(21-13-5-1-6-14-21)22-15-7-2-8-16-22)27(23-17-9-3-10-18-23)24-19-11-4-12-20-24/h1-20H
48 atoms
O  0.014495 0.254557 -2.854936
S  -0.126473 -0.037372 -1.3912
P  1.112392 1.461665 -0.217412
C  2.474537 1.52615 -1.418498
C  3.755498 1.033437 -1.173478
C  4.762303 1.206117 -2.109959
C  4.501186 1.863913 -3.302946
C  3.230882 2.361291 -3.551576
C  2.22438 2.204144 -2.613027
C  1.70298 0.307417 1.069149
C  1.743566 0.793529 2.372714
C  2.164378 -0.017778 3.417158
C  2.53282 -1.329361 3.168895
C  2.488386 -1.828075 1.872679
C  2.078165 -1.016104 0.829262
P  -2.021433 0.902951 -0.719969
C  -3.142573 -0.413379 -1.316327
C  -3.150374 -0.710888 -2.680764
C  -4.051238 -1.633272 -3.188679
C  -4.967995 -2.253116 -2.352111
C  -4.978166 -1.947918 -0.999645
C  -4.070687 -1.035399 -0.483024
C  -1.785795 0.467745 1.038203
C  -1.877793 1.493595 1.976415
C  -1.681863 1.233701 3.324976
C  -1.373113 -0.051025 3.743983
C  -1.260982 -1.07722 2.815628
C  -1.470573 -0.822325 1.471472
H  3.976675 0.520514 -0.247052
H  5.754134 0.824552 -1.905654
H  5.288081 1.995313 -4.034087
H  3.021489 2.878501 -4.478371
H  1.242858 2.613056 -2.811942
H  1.436397 1.812226 2.573279
H  2.194612 0.374783 4.42497
H  2.856095 -1.965853 3.982336
H  2.77648 -2.852382 1.675198
H  2.052525 -1.414649 -0.177057
H  -2.446296 -0.230902 -3.34888
H  -4.038161 -1.864957 -4.245517
H  -5.674494 -2.967412 -2.753862
H  -5.693466 -2.422257 -0.340343
H  -4.090929 -0.81019 0.575461
H  -2.106585 2.49969 1.647625
H  -1.767467 2.035789 4.046226
H  -1.212471 -0.254157 4.794714
H  -1.002895 -2.076474 3.139141
H  -1.39349 -1.632173 0.756733
totalener: -2079.25290656 hartree
nucrepener: 3067.79057651 hartree
electener: -5147.04348307 hartree
oneelecener: -8955.68432703 hartree
twoeener: 3808.64084396 hartree
kineticenergy: 2069.71854406 hartree
exchangeener: -117.398938221188 hartree
correlationener: -9.872261764338 hartree
xcener: -127.271199985527 hartree
chargesum: 0.0000000
charge: -0.649349 0.463144 0.361604 -0.169872 -0.247491 -0.200128 -0.231244 -0.203233 -0.220722 -0.198351 -0.241432 -0.202421 -0.231964 -0.209151 -0.228417 0.426347 -0.195683 -0.270711 -0.198284 -0.233433 -0.200007 -0.250005 -0.264818 -0.238385 -0.211421 -0.223479 -0.188091 -0.210969 0.242420 0.218531 0.220695 0.222014 0.241978 0.236510 0.222625 0.224768 0.226237 0.251216 0.269769 0.225655 0.222302 0.220765 0.244299 0.242860 0.225670 0.225808 0.226884 0.256961
charge: -0.620047 0.539886 0.336243 -0.205774 -0.132946 -0.137939 -0.126324 -0.131362 -0.113499 -0.206344 -0.117772 -0.133125 -0.125322 -0.137442 -0.131767 0.346494 -0.209241 -0.134715 -0.129387 -0.130319 -0.134196 -0.136728 -0.224482 -0.124110 -0.139173 -0.115374 -0.125896 -0.123963 0.144327 0.136007 0.136390 0.138413 0.146959 0.143513 0.137612 0.137600 0.138967 0.143723 0.153973 0.139209 0.136956 0.136946 0.144411 0.145255 0.138826 0.138075 0.140742 0.146719
qa: -0.6493 0.4631 0.3616 -0.1699 -0.2475 -0.2001 -0.2312 -0.2032 -0.2207 -0.1984 -0.2414 -0.2024 -0.2320 -0.2092 -0.2284 0.4263 -0.1957 -0.2707 -0.1983 -0.2334 -0.2000 -0.2500 -0.2648 -0.2384 -0.2114 -0.2235 -0.1881 -0.2110 0.2424 0.2185 0.2207 0.2220 0.2420 0.2365 0.2226 0.2248 0.2262 0.2512 0.2698 0.2257 0.2223 0.2208 0.2443 0.2429 0.2257 0.2258 0.2269 0.2570
va: 1.8093 3.2203 2.9309 3.7266 3.8196 3.8213 3.8207 3.8299 3.8190 3.7628 3.8243 3.8202 3.8200 3.8238 3.7897 2.9279 3.7412 3.7904 3.8183 3.8193 3.8270 3.8115 3.7699 3.8201 3.8126 3.8220 3.8294 3.7777 0.9041 0.9114 0.9110 0.9102 0.9146 0.9157 0.9102 0.9096 0.9091 0.9042 0.9096 0.9091 0.9106 0.9106 0.9056 0.9098 0.9091 0.9095 0.9105 0.9037
dispersion: -0.046023624 hartree
energy: -2079.235389632905 hartree
dipole: 3.23916 -3.09099 0.14817 -8.00186 7.27547 -0.72639 7.67890 -5.88302 1.79588
magnitude: 1.94288 au
magnitude: 4.93840 debye
temp: 298.15 k
press: 1.00 atm
zeropoint: 0.38377221 hartree
thermalvibcorrection: 0.02186838 hartree
thermalrotcorrection: 0.00141627 hartree
thermaltrasncorrection: 0.00141627 hartree
thermaltotal: -2078.82691650 hartree
thermalcorr: 0.02470092 hartree
nonthermalcorr: 0.38377221 hartree
totalcorr: 0.40847313 hartree
thermalcorrenthalpy: 0.00094421 hartree
totalenthalpy: -2078.82597229 hartree
vibrat: 0.03904543 hartree
rotat: 0.01713784 hartree
transl: 0.02089841 hartree
total: 0.07708168 hartree
totalentropycorr: -0.07708168 hartree
gibbsenthalpy: -2078.90305397 hartree
gibbsminuselec: 0.33233566 hartree
