program: Orca
programVersion: 5.0.4
elementType: S F C C C C C C H H H H H H
charge: 1
multiplicity: 1
keywords: Freq RIJCOSX PBEh-3c
frequency: 0.00 0.00 0.00 0.00 0.00 0.00 92.00 120.13 262.03 308.98 409.01 435.05 491.63 631.54 690.14 750.87 782.96 874.46 886.40 921.13 987.46 1038.37 1041.89 1067.64 1077.74 1079.32 1146.04 1158.63 1236.00 1253.10 1393.52 1428.59 1535.04 1556.57 1683.44 1690.00 2689.73 3276.33 3277.89 3292.97 3305.61 3310.21
frequency: 92.00 120.13 262.03 308.98 409.01 435.05 491.63 631.54 690.14 750.87 782.96 874.46 886.40 921.13 987.46 1038.37 1041.89 1067.64 1077.74 1079.32 1146.04 1158.63 1236.00 1253.10 1393.52 1428.59 1535.04 1556.57 1683.44 1690.00 2689.73 3276.33 3277.89 3292.97 3305.61 3310.21
formula: C6H6FS
InChI: InChI=1/C6H6FS/c7-8-6-4-2-1-3-5-6/h1-5,8H
14 atoms
S  2.337512 -0.878273 -0.509376
F  3.167425 -0.509448 0.801136
C  0.741009 -0.317216 -0.225186
C  0.442511 1.045973 -0.103535
C  -0.859042 1.406262 0.165846
C  -1.838742 0.424219 0.311123
C  -1.531561 -0.924904 0.190047
C  -0.231044 -1.312768 -0.070278
H  2.826315 0.12566 -1.267153
H  1.206722 1.804666 -0.21622
H  -1.118084 2.450848 0.264743
H  -2.857984 0.720318 0.520227
H  -2.30338 -1.67285 0.30262
H  0.018441 -2.362586 -0.164195
totalener: -728.80812761 hartree
nucrepener: 423.24130360 hartree
electener: -1152.04943121 hartree
oneelecener: -1826.77173694 hartree
twoeener: 674.72230573 hartree
kineticenergy: 725.88243797 hartree
exchangeener: -38.053041824936 hartree
correlationener: -3.026335299571 hartree
xcener: -41.079377124507 hartree
energy: -2447.9655 -689.4488 -290.8586 -290.0469 -289.9883 -289.5468 -289.3184 -289.2757 -233.7104 -176.3652 -176.2164 -176.0932 -42.6526 -32.2183 -30.3411 -28.2455 -27.4559 -24.1454 -23.8531 -22.3146 -21.8958 -20.8122 -20.4009 -19.5074 -19.0695 -18.4922 -18.2805 -16.9750 -16.8521 -16.1267 -15.9681 -13.6420 -13.2245 -7.0831 -4.7132 -4.2565 -4.0642 -2.4306 -0.0351 0.1634 0.8476 1.1826 1.2441 2.2319 2.8339 3.7603 4.1814 4.2602 6.5752 6.6549 8.7914 9.1092 9.6107 9.9215 10.2091 10.7148 11.0754 11.2013 11.5528 11.8151 12.0063 12.4531 12.6449 13.0059 13.5628 13.9931 14.7285 15.8352 16.0949 17.3305 17.9203 19.6078 20.3027 20.9583 21.9071 22.0537 22.5424 23.1482 23.5044 24.0754 24.7439 25.1141 25.2962 25.5784 26.8770 28.4870 28.7395 29.1252 29.3884 30.0176 30.3217 30.5855 31.4314 32.1484 34.7065 35.9934 36.2453 36.9434 37.2715 37.5439 38.3053 40.3514 42.3983 44.6236 45.2233 48.2773 50.5929 51.0326 52.7305 53.3365 54.5258 54.7213 55.0398 55.0922 58.9484 59.1351 59.8320 64.5040 66.1785 68.8896 69.0184 69.2103 70.7510 70.9971 71.3105 72.1234 78.3000 88.5047 354.8629 365.8729 366.0599 378.1713 379.4029 390.5140 883.2653 electronvolt
chargesum: 1.0000000
charge: 0.769259 -0.358470 -0.254448 -0.155949 -0.205499 -0.177566 -0.206644 -0.169853 0.294115 0.281266 0.295130 0.298190 0.295148 0.295318
charge: 0.952468 -0.303830 -0.254264 -0.090098 -0.097229 -0.038826 -0.102980 -0.082933 0.162842 0.165245 0.172497 0.173548 0.172884 0.170679
qa: 0.7693 -0.3585 -0.2544 -0.1559 -0.2055 -0.1776 -0.2066 -0.1699 0.2941 0.2813 0.2951 0.2982 0.2951 0.2953
va: 2.9620 0.9740 3.6973 3.7366 3.7974 3.7378 3.7942 3.7291 0.8878 0.8877 0.8815 0.8796 0.8816 0.8834
dispersion: -0.008132487 hartree
energy: -728.795266487617 hartree
dipole: -8.47595 8.54890 0.07295 2.68791 -2.54636 0.14155 -1.30876 0.46355 -0.84521
magnitude: 0.86008 au
magnitude: 2.18614 debye
temp: 298.15 k
press: 1.00 atm
zeropoint: 0.10748947 hartree
thermalvibcorrection: 0.00401709 hartree
thermalrotcorrection: 0.00141627 hartree
thermaltrasncorrection: 0.00141627 hartree
thermaltotal: -728.68092739 hartree
thermalcorr: 0.00684963 hartree
nonthermalcorr: 0.10748947 hartree
totalcorr: 0.11433910 hartree
thermalcorrenthalpy: 0.00094421 hartree
totalenthalpy: -728.67998318 hartree
vibrat: 0.00664395 hartree
rotat: 0.01360669 hartree
transl: 0.01923377 hartree
total: 0.03948441 hartree
totalentropycorr: -0.03948441 hartree
gibbsenthalpy: -728.71946759 hartree
gibbsminuselec: 0.07579890 hartree
