program: Orca
programVersion: 5.0.4
elementType: S C C C C C C O H H H H H H
charge: 0
multiplicity: 1
keywords: Opt RIJCOSX PBEh-3c
formula: C6H6OS
InChI: InChI=1/C6H6OS/c7-8-6-4-2-1-3-5-6/h1-5,8H
14 atoms
S  2.527741 -0.03194 -0.722794
C  0.789721 -0.05729 -0.251111
C  0.099326 -1.259458 -0.270734
C  -1.24872 -1.268689 0.048623
C  -1.895772 -0.080469 0.361169
C  -1.195737 1.116796 0.355244
C  0.156891 1.136736 0.042621
O  2.989622 1.384707 -0.773379
H  2.910726 -0.572371 0.484116
H  0.602858 -2.182662 -0.534018
H  -1.796671 -2.201345 0.042492
H  -2.950492 -0.089296 0.601532
H  -1.705147 2.041611 0.59175
H  0.715454 2.063769 0.02439
totalener: -704.48501524 hartree
nucrepener: 412.05874165 hartree
electener: -1116.54375689 hartree
oneelecener: -1782.38833505 hartree
twoeener: 665.84457816 hartree
kineticenergy: 701.65981762 hartree
exchangeener: -37.193733703276 hartree
correlationener: -3.012855545741 hartree
xcener: -40.206589249017 hartree
dispersion: -0.008336424 hartree
energy: -2441.0008 -529.4271 -285.3807 -285.0001 -284.8369 -284.7912 -284.7752 -284.7606 -226.7410 -169.3364 -169.3108 -169.1619 -30.6306 -26.7131 -23.9512 -23.3821 -21.3903 -19.1866 -18.4988 -16.5161 -14.9298 -14.6600 -14.2552 -13.7376 -13.5957 -12.2927 -11.8750 -11.6493 -11.3764 -9.1120 -8.8020 -8.5250 -7.6796 -0.2514 0.0201 1.8125 1.9232 3.0353 4.3614 4.8717 5.0897 5.5480 6.2648 6.6585 8.0066 8.4769 8.5938 8.9129 12.1201 12.5173 13.5270 14.0486 14.7568 14.9134 15.4785 16.2070 16.4632 16.5306 16.6640 16.7883 17.0234 17.2022 17.3628 18.3483 18.8494 19.6073 19.8900 20.5922 21.6435 23.3001 23.7981 24.6713 24.9985 25.2609 26.1955 26.3015 27.1770 27.5331 28.2645 28.7392 29.1243 29.3359 30.0366 30.7693 31.3477 32.0024 33.3097 34.4651 35.0194 35.2411 35.9346 36.7018 39.4243 41.1948 41.5807 42.0730 42.6836 44.4735 49.4333 49.5543 51.5444 51.9354 52.3691 54.1462 55.6356 55.9921 56.7130 57.9196 58.1652 59.2507 59.5671 59.6359 59.7492 60.3320 64.0483 64.2277 64.4263 69.5877 71.0909 74.0392 74.1194 74.6869 75.2281 76.0843 76.8158 76.8741 83.2440 93.6047 359.4144 370.6546 371.0714 383.6925 384.1449 395.6977 695.2355 electronvolt
chargesum: -0.0000000
charge: 0.614600 -0.239020 -0.209253 -0.212324 -0.216420 -0.212529 -0.199132 -0.672118 0.142554 0.233897 0.230415 0.229575 0.231475 0.278281
charge: 0.718301 -0.214090 -0.142008 -0.126821 -0.126370 -0.123343 -0.127988 -0.640735 0.057846 0.140843 0.140985 0.140729 0.141822 0.160830
qa: 0.6146 -0.2390 -0.2093 -0.2123 -0.2164 -0.2125 -0.1991 -0.6721 0.1426 0.2339 0.2304 0.2296 0.2315 0.2783
va: 3.2774 3.7449 3.7415 3.8411 3.8052 3.8151 3.7833 1.7840 0.9198 0.9078 0.9078 0.9083 0.9072 0.8987
dispersion: -0.008336107 hartree
energy: -704.472350210048 hartree
dipole: -5.98916 4.99124 -0.99792 -1.53848 0.45194 -1.08653 2.51973 -2.02342 0.49631
magnitude: 1.55651 au
magnitude: 3.95633 debye
