program: Orca
programVersion: 5.0.4
elementType: S C C C C C C H H H H H H
charge: 2
multiplicity: 1
keywords: SP DSD-BLYP D3BJ def2-QZVPP def2-QZVPP/C def2/J TightSCF
formula: C6H6S
InChI: InChI=1/C6H6S/c7-6-4-2-1-3-5-6/h1-5,7H
13 atoms
S  2.087212 -0.410401 -0.24865
C  0.502931 -0.042154 -0.052234
C  -0.412964 -1.197585 -0.056707
C  -1.740065 -0.984583 0.092832
C  -2.213691 0.348886 0.251324
C  -1.343403 1.489805 0.262904
C  -0.012536 1.315902 0.115999
H  2.632876 0.827613 -0.200522
H  -0.011081 -2.198879 -0.180211
H  -2.441916 -1.809522 0.093441
H  -3.281872 0.512547 0.37007
H  -1.766784 2.478954 0.388984
H  0.668262 2.159933 0.120491
totalener: -628.67329139 hartree
nucrepener: 321.47271823 hartree
electener: -950.14600962 hartree
oneelecener: -1474.61034456 hartree
twoeener: 524.46433493 hartree
kineticenergy: 627.74316670 hartree
exchangeener: -17.908485317247 hartree
correlationener: -1.075631974487 hartree
xcener: -18.984117291735 hartree
chargesum: 2.0000000
charge: 0.458629 0.168107 0.057599 -0.031713 0.167942 -0.021646 0.036957 0.205834 0.179083 0.195115 0.221649 0.192133 0.170312
charge: 1.248686 -0.263440 0.197704 0.184840 0.372203 0.195045 0.187972 -0.104089 -0.007219 -0.006290 0.013520 -0.006024 -0.012909
qa: 0.4586 0.1681 0.0576 -0.0317 0.1679 -0.0216 0.0370 0.2058 0.1791 0.1951 0.2216 0.1921 0.1703
va: 2.8735 3.7495 3.7036 3.8125 3.5619 3.8064 3.7501 0.9685 0.9652 0.9629 0.9403 0.9628 0.9684
total: -629.237936150 hartree
dispersion: -0.010151588 hartree
energy: -629.248087738219 hartree
dipole: -4.00063 3.77600 -0.22462 1.86057 -1.39229 0.46828 0.56276 -0.50221 0.06055
magnitude: 0.52289 au
magnitude: 1.32908 debye
