program: Orca
programVersion: 5.0.4
elementType: F S C C C C C C C C C C C C H H H H H H H H H H
charge: 1
multiplicity: 1
keywords: Freq RIJCOSX PBEh-3c
frequency: 0.00 0.00 0.00 0.00 0.00 0.00 15.85 51.43 83.56 121.42 165.42 234.54 275.23 281.43 343.07 406.70 420.36 443.90 490.94 502.72 538.08 633.51 635.52 702.18 711.43 734.57 753.22 786.14 789.66 871.20 880.63 888.99 981.67 988.29 1036.75 1038.99 1040.61 1042.96 1074.92 1075.30 1077.40 1078.59 1128.21 1141.28 1152.30 1159.53 1231.42 1231.68 1249.61 1254.55 1380.78 1389.61 1413.23 1416.85 1528.62 1535.25 1561.59 1562.19 1690.43 1693.83 1694.92 1697.60 3269.27 3274.09 3284.67 3289.29 3291.95 3297.55 3301.92 3304.95 3308.00 3309.17
frequency: 15.85 51.43 83.56 121.42 165.42 234.54 275.23 281.43 343.07 406.70 420.36 443.90 490.94 502.72 538.08 633.51 635.52 702.18 711.43 734.57 753.22 786.14 789.66 871.20 880.63 888.99 981.67 988.29 1036.75 1038.99 1040.61 1042.96 1074.92 1075.30 1077.40 1078.59 1128.21 1141.28 1152.30 1159.53 1231.42 1231.68 1249.61 1254.55 1380.78 1389.61 1413.23 1416.85 1528.62 1535.25 1561.59 1562.19 1690.43 1693.83 1694.92 1697.60 3269.27 3274.09 3284.67 3289.29 3291.95 3297.55 3301.92 3304.95 3308.00 3309.17
formula: C12H10FS
InChI: InChI=1/C12H10FS/c13-14(11-7-3-1-4-8-11)12-9-5-2-6-10-12/h1-10H
24 atoms
F  -0.087137 -0.075514 -2.622613
S  0.115527 -0.976707 -1.314153
C  -1.33143 -0.618396 -0.412439
C  -1.382547 0.299031 0.634734
C  -2.586692 0.484717 1.287383
C  -3.713098 -0.229437 0.896781
C  -3.646807 -1.149683 -0.141595
C  -2.449973 -1.360863 -0.798763
C  1.445803 -0.160975 -0.540057
C  2.416606 -0.992045 0.010311
C  3.500439 -0.407136 0.644017
C  3.612341 0.974505 0.69016
C  2.645937 1.788821 0.107263
C  1.54701 1.229564 -0.515995
H  -0.504186 0.838195 0.959494
H  -2.645699 1.184683 2.108908
H  -4.649246 -0.077043 1.416451
H  -4.524092 -1.70982 -0.432537
H  -2.391235 -2.090513 -1.597409
H  2.337766 -2.070271 -0.053211
H  4.264389 -1.032432 1.083788
H  4.468065 1.425415 1.173906
H  2.755006 2.86403 0.133016
H  0.803354 1.861574 -0.983242
totalener: -959.38191014 hartree
nucrepener: 943.33301187 hartree
electener: -1902.71492201 hartree
oneelecener: -3168.15978635 hartree
twoeener: 1265.44486434 hartree
kineticenergy: 954.60911418 hartree
exchangeener: -56.210195115962 hartree
correlationener: -4.773925320135 hartree
xcener: -60.984120436097 hartree
energy: -2447.0355 -688.5279 -290.0477 -289.9817 -289.2124 -289.1648 -289.1560 -289.1441 -288.7236 -288.7065 -288.6372 -288.6007 -288.5921 -288.5722 -232.6994 -175.3648 -175.2108 -175.0857 -41.6997 -31.7251 -30.7816 -29.5487 -27.6667 -27.5142 -27.3776 -26.2005 -23.5700 -23.3638 -23.0671 -22.6243 -21.2338 -21.0890 -20.0246 -19.6802 -19.5390 -18.7241 -18.6495 -18.3871 -18.1270 -17.7591 -17.6699 -17.3849 -16.3528 -16.2491 -15.9176 -15.5243 -15.4335 -15.2254 -14.9363 -13.0300 -12.5295 -12.4995 -12.4328 -6.1723 -4.4788 -3.9724 -3.7681 -3.3638 -2.4029 -1.4700 0.4042 0.5828 0.8618 1.0460 1.4471 1.5778 1.7762 1.8900 2.1361 2.6636 2.7621 3.0563 3.4589 4.3042 4.5260 4.7706 4.7979 4.9128 5.1277 5.4812 7.4344 7.7683 8.2019 9.3055 9.8183 9.9414 10.1393 10.5465 10.7968 11.0376 11.5419 11.8188 11.9971 12.1851 12.4206 12.4409 12.4930 12.6760 12.6767 12.8641 13.1146 13.1624 13.4002 13.5067 13.5806 14.2715 14.5122 14.5871 14.9122 15.7082 16.0361 16.3907 16.7141 17.2131 17.7449 18.4263 19.1651 19.8624 20.6809 21.2228 21.5125 21.6272 22.1265 22.2404 22.5575 22.7177 22.8445 23.1411 23.6338 23.7935 24.0684 24.3135 24.5115 25.1622 25.3591 25.6195 25.8601 26.2448 26.7564 27.2021 27.3996 27.7481 29.0734 29.3117 29.8636 30.4272 30.6342 30.6847 30.8514 31.0440 31.3717 31.7020 32.1824 32.9302 33.1279 34.2777 35.5535 36.2606 36.9100 36.9970 37.6117 37.6739 37.9825 38.0167 38.0653 38.8108 39.1202 39.3526 40.3318 41.7699 44.4353 45.7871 46.1872 46.3222 46.8571 48.8486 49.7176 51.3227 51.6257 52.1000 52.3878 53.5357 54.0145 54.3853 54.6506 55.4228 55.4619 55.5816 55.6884 55.7692 55.9012 55.9774 56.3529 59.8374 59.9225 60.0381 60.0816 60.6055 60.6477 65.4054 65.8294 67.1363 67.5059 69.5158 69.7596 69.8445 70.2048 70.5512 70.6702 71.4975 71.8874 71.9150 72.2247 72.9875 73.1508 74.2594 79.4128 79.4714 89.3128 89.6150 355.6938 356.5506 366.7991 367.0066 367.2465 368.0769 379.3680 379.4929 380.3414 380.5142 391.3880 391.6654 886.7166 electronvolt
chargesum: 1.0000000
charge: -0.372121 0.946037 -0.211837 -0.173569 -0.208436 -0.187747 -0.207679 -0.194534 -0.220921 -0.196398 -0.211683 -0.188372 -0.215672 -0.186588 0.281417 0.278910 0.283214 0.282474 0.277899 0.282155 0.282262 0.283002 0.281290 0.296899
charge: -0.309893 1.070247 -0.223729 -0.102181 -0.105660 -0.061771 -0.104351 -0.099652 -0.221570 -0.105047 -0.105036 -0.068700 -0.104477 -0.113288 0.164621 0.164441 0.166454 0.166580 0.163879 0.164398 0.166303 0.166307 0.165399 0.166727
qa: -0.3721 0.9460 -0.2118 -0.1736 -0.2084 -0.1877 -0.2077 -0.1945 -0.2209 -0.1964 -0.2117 -0.1884 -0.2157 -0.1866 0.2814 0.2789 0.2832 0.2825 0.2779 0.2822 0.2823 0.2830 0.2813 0.2969
va: 0.9694 3.0920 3.7241 3.7500 3.7959 3.7589 3.8012 3.7425 3.7582 3.7468 3.8063 3.7587 3.8079 3.7384 0.8807 0.8891 0.8866 0.8874 0.8936 0.8890 0.8875 0.8870 0.8882 0.8797
dispersion: -0.017113792 hartree
energy: -959.365320537367 hartree
dipole: -0.11210 0.08799 -0.02411 2.58311 -2.70246 -0.11935 8.74086 -7.99326 0.74759
magnitude: 0.75745 au
magnitude: 1.92527 debye
temp: 298.15 k
press: 1.00 atm
zeropoint: 0.19191628 hartree
thermalvibcorrection: 0.00864820 hartree
thermalrotcorrection: 0.00141627 hartree
thermaltrasncorrection: 0.00141627 hartree
thermaltotal: -959.16192352 hartree
thermalcorr: 0.01148074 hartree
nonthermalcorr: 0.19191628 hartree
totalcorr: 0.20339702 hartree
thermalcorrenthalpy: 0.00094421 hartree
totalenthalpy: -959.16097931 hartree
vibrat: 0.01508658 hartree
rotat: 0.01514742 hartree
transl: 0.01988976 hartree
total: 0.05012376 hartree
totalentropycorr: -0.05012376 hartree
gibbsenthalpy: -959.21110307 hartree
gibbsminuselec: 0.15421746 hartree
