program: Orca
programVersion: 5.0.4
elementType: F S C C C C C C F C C C C C C H H H H H H H H H H
charge: 0
multiplicity: 1
keywords: SP DSD-BLYP D3BJ def2-QZVPP def2-QZVPP/C def2/J TightSCF
formula: C12H10F2S
InChI: InChI=1/C12H10F2S/c13-15(14,11-7-3-1-4-8-11)12-9-5-2-6-10-12/h1-10H
25 atoms
F  -0.071522 -2.12694 0.406547
S  -0.092816 -0.591172 1.200627
C  -1.433804 -0.073916 0.118362
C  -1.478073 1.22588 -0.36654
C  -2.526364 1.60567 -1.188009
C  -3.537353 0.707715 -1.498369
C  -3.491139 -0.581743 -0.993917
C  -2.433561 -0.984604 -0.191199
F  -0.080342 0.985511 1.916308
C  1.39621 -0.143013 0.306937
C  1.493416 -0.364894 -1.0582
C  2.657587 -0.004022 -1.717137
C  3.723383 0.537837 -1.013388
C  3.620837 0.73081 0.355114
C  2.449775 0.404046 1.022023
H  -0.7050 1.936783 -0.117893
H  -2.555353 2.61398 -1.57859
H  -4.359729 1.01398 -2.131201
H  -4.276467 -1.287135 -1.229865
H  -2.398708 -1.996958 0.181278
H  0.672088 -0.799764 -1.609605
H  2.732588 -0.154488 -2.785696
H  4.633063 0.809588 -1.532039
H  4.450063 1.148128 0.910132
H  2.368627 0.576553 2.085334
totalener: -1059.14573495 hartree
nucrepener: 1108.61508211 hartree
electener: -2167.76081706 hartree
oneelecener: -3656.70040139 hartree
twoeener: 1488.93958434 hartree
kineticenergy: 1057.26329420 hartree
exchangeener: -34.506140842032 hartree
correlationener: -2.222987633507 hartree
xcener: -36.729128475539 hartree
chargesum: 0.0000000
charge: -0.500186 0.696652 0.104152 -0.078467 -0.102114 -0.100517 -0.085968 -0.119927 -0.502470 0.147764 -0.081461 -0.102516 -0.104013 -0.088048 -0.119091 0.107153 0.099770 0.093576 0.098963 0.122900 0.102582 0.098979 0.096039 0.099418 0.116829
charge: -0.105062 0.572348 -0.248101 0.063978 0.071975 0.076234 0.071245 0.058707 -0.106899 -0.252523 0.065563 0.072849 0.075735 0.072347 0.059212 -0.051475 -0.057278 -0.056192 -0.057463 -0.054613 -0.047645 -0.057478 -0.056505 -0.057403 -0.051559
qa: -0.5002 0.6967 0.1042 -0.0785 -0.1021 -0.1005 -0.0860 -0.1199 -0.5025 0.1478 -0.0815 -0.1025 -0.1040 -0.0880 -0.1191 0.1072 0.0998 0.0936 0.0990 0.1229 0.1026 0.0990 0.0960 0.0994 0.1168
va: 0.6960 3.2655 3.6350 3.7422 3.7817 3.8515 3.7821 3.7745 0.6907 3.5789 3.7447 3.7839 3.8519 3.7850 3.7822 1.0050 0.9859 0.9869 0.9860 0.9902 0.9998 0.9849 0.9854 0.9851 0.9866
total: -1060.515444660 hartree
dispersion: -0.023374819 hartree
energy: -1060.538819478870 hartree
dipole: 0.66985 -0.61784 0.05201 4.69652 -4.19166 0.50486 -9.51207 8.48982 -1.02225
magnitude: 1.14131 au
magnitude: 2.90097 debye
