program: Gaussian 09
title: 000076493
version: EM64L-G09RevD.01
frameworkgroup: C1[X(C9H20ClO3P)]
method: RPBEPBE
basis: SDD
operation: Freq
keyword: #p
keyword: freq=noraman
keyword: PBEPBE/SDD
title: #p freq=noraman PBEPBE/SDD
converged: YES YES NO NO
title: Mulliken charges:
elementType: Cl P O O O C C C C C C C C C H H H H H H H H H H H H H H H H H H H H
charge: -0.002925 1.332445 -0.549922 -0.489868 -0.603939 -0.352924 -0.356766 -0.251418 -0.265625 -0.347874 -0.347770 -0.826360 -0.681806 -0.682163 0.204529 0.208708 0.210182 0.217732 0.235276 0.211633 0.219913 0.212009 0.195871 0.200248 0.192197 0.196525 0.324918 0.308727 0.210628 0.212339 0.220038 0.212517 0.215103 0.217822
chargesum: 0.00000
title: Mulliken charges with hydrogens summed into heavy atoms:
elementType: Cl P O O O C C C C C C C C C
charge: -0.002925 1.332445 -0.549922 -0.489868 -0.603939 0.060312 0.071148 0.195491 0.166297 0.048245 0.040953 -0.192715 -0.038801 -0.036721
polarizability: 1.71663615e+02 -3.81181068e+00 1.45232075e+02 -3.30895318e+00 -2.48003800e+00 1.17529520e+02
1716.lowfreq: -9.6775 -5.8049 0.0021 0.0022 0.0022 3.9333 11.6729 20.3266 39.3777
frequency: -3.3423 19.6228 39.2858 46.6814 56.3782 71.5217 76.5765 92.6016 101.9241 115.4402 124.8761 138.5338 176.0580 180.4338 205.0451 221.0032 226.3855 237.7854 256.4763 312.6312 354.3882 375.1224 391.0236 435.9146 464.7877 608.5113 660.6400 705.9284 741.9539 744.5926 744.9046 798.2372 810.8755 830.2117 898.2386 900.1727 932.3943 933.7415 937.3720 942.3426 1036.6071 1039.3230 1049.8226 1081.7941 1083.4156 1116.9867 1118.1035 1134.1802 1142.8463 1146.4847 1210.3270 1213.2656 1231.4591 1270.3575 1271.8704 1273.2631 1282.5737 1283.7700 1287.0265 1343.8624 1345.1949 1366.9248 1372.7001 1387.7658 1393.3357 1399.0396 1469.1131 1470.5986 1474.4097 1475.0074 1475.4917 1478.9427 1482.3053 1483.5279 1491.2234 1491.5967 2964.8250 2968.7229 2970.5895 2975.4436 2977.8509 2981.0212 2993.0665 3000.6526 3012.0910 3014.4594 3027.2968 3037.2322 3064.0402 3066.8263 3075.6071 3075.9264 3076.5813 3076.9728 3077.9416 3169.5730
redmass: 3.2936 4.0037 2.1846 3.8683 1.9961 4.1768 3.6366 2.6237 2.3532 2.6578 2.4316 3.5767 4.1107 4.1433 7.2561 2.8711 1.3068 1.1499 5.9183 4.5604 4.2447 5.1225 4.7705 3.5118 5.1988 7.5883 9.3028 10.0235 1.0950 1.0795 6.0123 1.1282 1.1359 1.5662 1.8153 1.8221 4.5102 1.1767 1.4726 4.6925 3.8295 3.5445 4.2305 2.2532 2.2482 2.3158 2.4490 1.3181 1.4251 1.4455 1.3754 1.3676 1.1490 1.2669 1.1740 1.2863 1.1570 1.0767 1.0819 1.3943 1.4685 1.4493 1.3328 1.2135 1.2051 1.0835 1.0782 1.0753 1.0645 1.0618 1.0441 1.0417 1.0689 1.0699 1.0913 1.0902 1.0560 1.0583 1.0584 1.0370 1.0361 1.0577 1.0586 1.0594 1.1000 1.1004 1.1062 1.1045 1.1059 1.1041 1.0608 1.0962 1.0994 1.1006 1.1012 1.1111
irintensity: 0.0924 0.3000 0.0882 1.5165 0.2807 0.6293 4.9704 0.0980 0.1653 1.8635 0.6136 2.5803 10.0967 4.3215 0.7841 0.7082 0.2080 0.2356 10.3797 7.9279 8.3790 29.9773 18.9049 4.1246 23.0465 10.9239 89.6528 115.4186 3.8543 9.3970 59.0960 0.2233 1.4200 19.1058 26.5751 25.2669 225.8869 7.1579 67.8757 151.1212 56.7731 22.2414 72.1729 5.1097 2.5872 4.0503 6.1408 41.7468 0.8851 1.8528 0.2822 0.0173 1.6991 1.9867 1.4695 4.0315 1.0060 0.1068 0.2184 0.4402 0.7821 20.9316 10.0683 7.7891 11.1707 10.9907 0.9895 0.2747 0.1787 1.6395 11.8441 12.7669 9.4425 4.1399 29.2690 5.7603 10.0978 49.2047 22.2338 30.0767 34.3327 21.2408 55.2847 35.4021 12.8174 5.7926 5.1844 0.3299 6.5184 4.1359 17.0372 106.3097 43.0147 65.6607 89.3376 0.3513
temp: 298.150 k
press: 1.00000 atm
elementType: 17 15 8 8 8 6 6 6 6 6 6 6 6 6 1 1 1 1 1 1 1 1 1 1 1 1 1 1 1 1 1 1 1 1
symmnumber: 1
zpe: 742832.2 jmol-1
zpe.correction: 0.282930 hartree
zpe.thermalcorrener: 0.301702 hartree
zpe.thermalcorrenthalpy: 0.302646 hartree
zpe.thermalcorrgfe: 0.232933 hartree
zpe.sumelectzpe: -1380.720444 hartree
zpe.sumelectthermal: -1380.701672 hartree
zpe.sumelectthermalent: -1380.700728 hartree
zpe.sumelectthermalfe: -1380.770441 hartree
dipole: -1.4666 3.3733 -3.8437
dipole: 5.3202
quadrupole: -93.6396 -103.6693 -109.2509
quadrupole: 3.7156 -2.0852 8.4506
quadrupole: 8.5470 -1.4827 -7.0643 3.7156 -2.0852 8.4506
hfenergy: -1381.0033735 hartree
pointgroup: C01 [X(C9H20Cl1O3P1)]
dipole: 0.3024418 1.7561066 1.098074 debye
polarizability: 169.4074144|7.2785551|146.493709|-5.2343112|-5.8826467|118.5240874 unknown
InChI: InChI=1S/C9H20ClO3P/c1-3-5-7-12-14(11,9-10)13-8-6-4-2/h3-9H2,1-2H3
charge 0 multiplicity 1
34 atoms
Cl -1.884429 -3.317635 1.887268
P  0.132132 -1.756437 0.102534
O  1.226017 -0.509779 0.648406
O  -1.26178 -0.917668 -0.497656
O  0.711946 -2.779213 -0.962561
C  3.150151 0.959509 0.484793
C  -2.970328 0.798861 -0.535154
C  2.26698 -0.011805 -0.298817
C  -1.931634 0.110297 0.351701
C  4.281573 1.544965 -0.39509
C  -3.761977 1.878231 0.241065
C  -0.266123 -2.396815 1.830613
C  5.171334 2.541029 0.379033
C  -4.809498 2.586022 -0.645364
H  2.522911 1.779351 0.884954
H  3.585037 0.430321 1.354449
H  -2.457353 1.253992 -1.40368
H  -3.662888 0.033755 -0.933615
H  2.843656 -0.873716 -0.68503
H  1.769064 0.491438 -1.150872
H  -1.176551 0.830221 0.72551
H  -2.418714 -0.393089 1.211668
H  3.839996 2.052373 -1.276786
H  4.90687 0.719039 -0.789945
H  -3.058703 2.630192 0.65393
H  -4.269078 1.41179 1.110081
H  0.528229 -3.095301 2.127415
H  -0.331218 -1.549853 2.526268
H  4.576569 3.393085 0.758224
H  5.651515 2.053105 1.247816
H  5.971945 2.947473 -0.265255
H  -4.327891 3.088122 -1.505169
H  -5.542467 1.862016 -1.047408
H  -5.367293 3.351223 -0.075428
