program: Orca
programVersion: 5.0.4
elementType: S F F H
charge: 1
multiplicity: 1
keywords: SP DSD-BLYP D3BJ def2-QZVPP def2-QZVPP/C def2/J TightSCF
formula: HF2S
InChI: InChI=1/F2HS/c1-3-2/h3H
4 atoms
S  -0.018798 0.349941 0.380388
F  1.219569 -0.266022 -0.314124
F  -1.183486 -0.403131 -0.308004
H  -0.082107 1.480236 -0.374741
totalener: -597.49396527 hartree
nucrepener: 126.84715868 hartree
electener: -724.34112395 hartree
oneelecener: -1069.46214182 hartree
twoeener: 345.12101788 hartree
kineticenergy: 596.66322539 hartree
exchangeener: -14.060331967422 hartree
correlationener: -0.727418446797 hartree
xcener: -14.787750414219 hartree
energy: -2484.4694 -708.3741 -708.3712 -246.9951 -186.9411 -186.8587 -186.6888 -50.0005 -48.6532 -33.7327 -27.3998 -27.3728 -26.4200 -24.7885 -24.0267 -23.9575 -20.4133 -6.9531 -6.6097 -4.3321 -0.8225 -0.3949 0.3037 0.4251 1.3738 1.6905 3.2885 3.6542 3.9755 5.8740 6.3621 6.4392 7.2483 8.5297 9.0566 9.6795 12.9564 15.1363 16.1094 18.3953 19.4296 19.9582 19.9674 20.4212 21.0547 21.0662 21.8355 23.6754 24.6939 25.4145 26.4850 27.0995 27.7206 27.7784 31.2105 34.3655 35.8727 37.2828 38.9942 40.1754 41.0878 42.2294 42.5654 43.0461 44.1233 44.2670 45.0487 48.8650 50.8698 51.2844 51.8896 52.1655 56.1066 57.0709 59.3720 60.1296 63.7435 66.7404 66.8069 67.3421 68.2693 69.9763 72.0891 73.4043 75.8970 76.5156 76.6979 77.8180 78.9529 79.9511 81.4770 83.2745 83.6969 84.9404 86.9737 90.5260 90.7961 91.2485 92.0626 93.2313 93.7183 96.8031 97.3729 103.4778 103.6461 110.4736 111.0457 111.8550 113.0696 113.7029 116.3987 117.2993 119.4305 121.5174 121.8188 126.4981 132.2622 134.5488 135.2265 136.7336 138.3272 140.3736 141.1866 142.0252 147.4068 148.1486 152.8604 153.8300 155.7778 156.9810 158.3133 160.5698 167.9890 170.1005 170.2396 171.5699 172.3165 173.8239 173.9684 176.6959 180.5381 181.1240 182.3468 183.9744 194.9315 196.0640 204.7144 214.1699 214.5782 214.8734 217.8482 229.9850 232.2765 234.3463 237.2730 237.3135 238.7346 239.8199 245.0004 280.6950 309.7482 309.9249 310.0892 310.4648 310.5393 310.5441 310.5613 310.5688 311.2457 311.7281 312.4101 312.8402 314.2023 315.8484 315.8770 317.8802 318.8958 319.8579 398.0670 398.1306 398.6220 398.9216 401.3874 401.5819 402.7660 404.8316 406.1955 407.2698 410.6465 412.2488 412.4624 413.4274 432.0728 434.2368 434.5010 434.5716 437.0615 437.9442 440.8411 442.7644 444.5263 446.9488 454.5065 454.6890 671.6705 797.4984 802.0036 806.2573 1492.9052 1493.0036 2301.7536 7808.7785 7808.8849 12332.7105 electronvolt
chargesum: 1.0000000
charge: 1.113253 -0.164174 -0.164599 0.215521
charge: 0.674461 0.212362 0.211570 -0.098392
qa: 1.1133 -0.1642 -0.1646 0.2155
va: 3.2437 1.1994 1.1990 0.9431
total: -597.854418793 hartree
dispersion: -0.001152314 hartree
energy: -597.855571106981 hartree
dipole: -0.10992 0.04341 -0.06651 1.99857 -0.77994 1.21862 0.21381 0.20836 0.42217
magnitude: 1.29139 au
magnitude: 3.28246 debye
