program: Orca
programVersion: 5.0.4
elementType: F S F F
charge: 1
multiplicity: 1
keywords: Opt RIJCOSX PBEh-3c
formula: F3S
InChI: InChI=1/F3S/c1-4(2)3
4 atoms
F  1.261074 -0.485258 -0.179135
S  -0.001614 -0.00483 0.543787
F  -1.055259 -0.840861 -0.18896
F  -0.204302 1.330948 -0.175693
totalener: -696.30357199 hartree
nucrepener: 204.29758121 hartree
electener: -900.60115319 hartree
oneelecener: -1358.43756429 hartree
twoeener: 457.83641110 hartree
kineticenergy: 693.75928552 hartree
exchangeener: -30.782146586819 hartree
correlationener: -2.075023125803 hartree
xcener: -32.857169712622 hartree
dispersion: -0.000878793 hartree
energy: -2454.8348 -693.3152 -693.3111 -693.3098 -239.8752 -182.4934 -182.4931 -182.2245 -48.4309 -46.1389 -46.1302 -31.7272 -26.9129 -26.9017 -26.0609 -24.0400 -24.0249 -22.8361 -22.8258 -22.3919 -20.4637 -8.4719 -8.4286 -5.6715 1.5375 5.8144 5.8602 5.8658 8.7620 8.7695 10.5246 15.7953 15.8240 22.1772 22.2372 22.3781 24.6154 24.6351 24.9569 25.5155 25.6388 26.1804 26.2884 26.3079 27.2748 27.3627 28.1440 28.1572 34.6781 34.6854 35.4773 35.6162 35.8840 36.6629 38.1708 38.2163 46.8966 69.0563 69.1500 69.6518 878.8727 878.9436 885.4865 electronvolt
chargesum: 1.0000000
charge: -0.276284 1.828088 -0.275964 -0.275840
charge: -0.184263 1.551917 -0.183927 -0.183727
qa: -0.2763 1.8281 -0.2760 -0.2758
va: 1.1378 3.1450 1.1382 1.1378
energy: -696.290145361835 hartree
dipole: -0.00208 -0.00069 -0.00277 -0.00632 -0.00146 -0.00779 0.71211 0.07058 0.78269
magnitude: 0.78273 au
magnitude: 1.98954 debye
