program: Orca
programVersion: 5.0.4
elementType: F S F F F
charge: 0
multiplicity: 1
keywords: Freq RIJCOSX PBEh-3c
frequency: 0.00 0.00 0.00 0.00 0.00 0.00 212.52 343.49 443.92 512.51 520.32 629.17 861.04 922.28 934.61
frequency: 212.52 343.49 443.92 512.51 520.32 629.17 861.04 922.28 934.61
formula: F4S
InChI: InChI=1/F4S/c1-5(2,3)4
5 atoms
F  -0.681382 -1.333323 0.761912
S  -0.433756 0.077448 -0.059433
F  0.565349 -0.714778 -0.992324
F  0.040712 1.455068 -0.838713
F  0.509077 0.515484 1.128558
totalener: -796.30475423 hartree
nucrepener: 296.00225348 hartree
electener: -1092.30700771 hartree
oneelecener: -1694.61101437 hartree
twoeener: 602.30400666 hartree
kineticenergy: 793.23006204 hartree
exchangeener: -36.627507068042 hartree
correlationener: -2.554974504828 hartree
xcener: -39.182481572870 hartree
energy: -2446.7580 -685.1595 -685.1435 -683.0900 -683.0711 -231.5910 -174.2121 -174.2109 -173.9749 -39.8256 -37.9902 -36.1809 -35.6871 -23.8375 -18.9725 -18.5532 -18.0822 -16.3372 -15.5353 -15.3205 -15.1036 -13.7252 -13.5433 -13.2368 -13.0206 -10.7901 -1.0443 1.2939 3.2197 9.0210 12.5635 13.4831 14.0375 14.8933 16.9476 17.3598 23.0479 24.8569 27.9495 27.9714 28.5950 28.6946 30.7063 31.1416 31.3335 31.6494 32.6154 33.3158 33.5843 33.8254 34.2511 34.4429 34.4607 34.5606 34.5812 35.0053 35.1380 37.5978 38.4460 40.5459 42.3435 42.4492 42.9676 43.9728 45.2462 46.6363 47.8968 51.6458 53.7204 55.0141 72.3107 75.4086 78.4268 80.1907 885.5724 887.0962 888.6196 895.5573 electronvolt
chargesum: 0.0000000
charge: -0.460820 1.674321 -0.376205 -0.461529 -0.375766
charge: -0.400698 1.376504 -0.287345 -0.401557 -0.286904
qa: -0.4608 1.6743 -0.3762 -0.4615 -0.3758
va: 0.9049 3.4069 1.0046 0.9038 1.0047
dispersion: -0.001313275 hartree
energy: -796.280829751169 hartree
dipole: -0.58518 0.26302 -0.32216 0.10451 -0.05210 0.05241 -0.08018 0.03547 -0.04471
magnitude: 0.32944 au
magnitude: 0.83737 debye
temp: 298.15 k
press: 1.00 atm
zeropoint: 0.01225624 hartree
thermalvibcorrection: 0.00190767 hartree
thermalrotcorrection: 0.00141627 hartree
thermaltrasncorrection: 0.00141627 hartree
thermaltotal: -796.26383330 hartree
thermalcorr: 0.00474021 hartree
nonthermalcorr: 0.01225624 hartree
totalcorr: 0.01699645 hartree
thermalcorrenthalpy: 0.00094421 hartree
totalenthalpy: -796.26288909 hartree
vibrat: 0.00289571 hartree
rotat: 0.01224691 hartree
transl: 0.01898092 hartree
total: 0.03412354 hartree
totalentropycorr: -0.03412354 hartree
gibbsenthalpy: -796.29701264 hartree
gibbsminuselec: -0.01618289 hartree
