program: Orca
programVersion: 5.0.4
elementType: F S F O
charge: 0
multiplicity: 1
keywords: SP DSD-BLYP D3BJ def2-QZVPP def2-QZVPP/C def2/J TightSCF
formula: F2OS
InChI: InChI=1/F2OS/c1-4(2)3
4 atoms
F  -1.084472 -0.847519 -0.246012
S  -0.015204 0.155307 0.419338
F  1.235612 -0.603723 -0.252252
O  -0.148999 1.412015 -0.248751
totalener: -672.33988854 hartree
nucrepener: 191.58366252 hartree
electener: -863.92355106 hartree
oneelecener: -1311.53913598 hartree
twoeener: 447.61558491 hartree
kineticenergy: 671.30144981 hartree
exchangeener: -16.618258126443 hartree
correlationener: -0.893160417777 hartree
xcener: -17.511418544220 hartree
energy: -2477.1720 -700.4643 -700.4636 -546.1020 -239.5375 -179.4838 -179.4461 -179.2280 -42.0669 -40.6045 -35.9939 -24.1905 -19.9453 -19.1268 -18.4953 -17.1207 -17.1193 -16.3285 -14.7099 -13.6609 -12.1428 0.7697 1.9547 3.4969 4.6474 5.6388 5.8765 6.7329 8.7568 8.8670 9.5673 9.8949 10.0306 11.4723 12.2265 12.4037 12.7246 13.2389 14.3785 14.7785 15.9000 18.8043 21.3772 24.5896 25.5049 26.2891 26.7134 26.9650 27.9035 28.0322 28.3092 30.3947 31.1052 31.4309 32.8717 33.7793 33.8061 35.8384 36.3698 39.4357 40.6730 41.1474 41.6224 41.9164 43.8141 44.4584 46.1000 47.9505 48.7140 49.5030 49.5791 49.6392 50.2132 50.7529 51.2181 54.6358 55.6417 55.9488 56.6887 59.8078 60.4086 62.8976 64.4229 73.5405 73.7446 75.7891 77.6512 77.9705 78.9088 80.3774 81.8926 82.6510 84.2220 85.4077 86.9183 87.6679 88.4163 89.6597 90.2150 92.9829 93.4612 93.8266 95.2506 96.1216 97.7977 98.2730 99.7579 101.4135 102.7840 103.6927 105.6456 109.7721 111.5220 113.1702 114.1482 114.3450 117.8050 118.2933 118.8204 119.9303 120.8059 121.4554 121.7748 122.6494 125.5256 129.1712 129.9221 131.8332 134.0233 136.1093 136.9671 138.2167 138.9606 140.9136 142.3688 143.4778 145.1517 146.7835 149.2885 149.3993 151.8960 153.0382 155.2780 155.4107 161.8636 162.3642 164.4060 165.1438 178.8344 179.7215 180.2383 181.2777 181.9124 186.8001 195.8248 198.5022 200.9074 212.8344 239.1752 239.9196 242.7299 243.7260 248.0779 248.0844 249.2864 249.6053 249.8810 254.8466 257.1845 268.9256 270.0258 279.0104 306.9014 307.0366 313.0215 313.8275 317.3291 317.4280 317.5688 317.8860 317.9901 318.0028 318.0174 318.0407 318.5836 319.0162 319.3598 320.0752 320.3248 321.9016 322.3490 323.5227 325.1229 325.1509 327.8665 330.9260 331.0036 335.6316 337.4441 344.7435 345.6416 360.7239 388.7066 405.7284 405.7726 405.9694 406.1873 407.5868 408.4578 410.0567 411.3037 412.8494 414.2335 417.6895 417.7419 418.1598 418.2203 438.4160 439.1873 440.3302 441.1799 442.6964 442.8205 449.1185 449.7586 451.1601 453.1306 460.7444 460.9686 677.6234 804.8885 810.7204 817.3052 1323.0178 1496.9961 1497.9238 2308.0166 6931.4356 7812.1130 7813.0511 12338.3241 electronvolt
chargesum: 0.0000000
charge: -0.328786 1.068351 -0.328771 -0.410793
charge: 0.038495 -0.020765 0.038473 -0.056203
qa: -0.3288 1.0684 -0.3288 -0.4108
va: 0.9458 3.8913 0.9459 2.1176
total: -672.836462062 hartree
dispersion: -0.001531211 hartree
energy: -672.837993273052 hartree
dipole: -0.14180 0.17115 0.02935 1.36100 -1.62244 -0.26145 0.44580 0.27407 0.71987
magnitude: 0.76644 au
magnitude: 1.94814 debye
