program: Orca
programVersion: 5.0.4
elementType: F S F
charge: 2
multiplicity: 1
keywords: Opt RIJCOSX PBEh-3c
formula: F2S
InChI: InChI=1/F2S/c1-3-2
3 atoms
F  1.165942 -0.30069 0.0000
S  -0.000461 0.60316 0.0000
F  -1.165381 -0.30257 0.0000
totalener: -595.86731804 hartree
nucrepener: 121.66821034 hartree
electener: -717.53552838 hartree
oneelecener: -1044.35986783 hartree
twoeener: 326.82433945 hartree
kineticenergy: 593.96349299 hartree
exchangeener: -24.901182626339 hartree
correlationener: -1.591748436842 hartree
xcener: -26.492931063182 hartree
dispersion: -0.000500935 hartree
energy: -2465.3456 -704.1174 -704.1164 -250.3358 -192.9225 -192.9164 -192.7103 -58.4763 -56.7470 -41.1482 -36.5466 -35.5020 -35.1131 -33.0231 -32.7213 -31.6446 -22.7002 -17.1998 -16.4094 -6.9219 -3.1341 -3.0264 -2.3220 -0.0918 1.6331 1.7850 2.6681 8.1159 14.7495 15.6844 16.5590 16.6561 16.8841 17.9180 17.9623 18.3638 18.4408 19.9774 25.6414 26.1494 26.3029 27.5419 28.2584 33.2576 60.6223 60.6864 869.1724 871.9061 electronvolt
chargesum: 2.0000000
charge: -0.053505 2.106998 -0.053493
charge: 0.041284 1.917421 0.041296
qa: -0.0535 2.1070 -0.0535
va: 1.4725 2.7517 1.4725
dispersion: -0.000500929 hartree
energy: -595.862151819300 hartree
dipole: -0.00062 -0.00036 -0.00098 0.75308 0.41342 1.16650 0.00000 0.00000 0.00000
magnitude: 1.16650 au
magnitude: 2.96500 debye
