program: Orca
programVersion: 5.0.4
elementType: F S F C H H H
charge: 1
multiplicity: 1
keywords: Opt RIJCOSX PBEh-3c
formula: CH3F2S
InChI: InChI=1/CH3F2S/c1-4(2)3/h1H3
7 atoms
F  1.422817 1.287683 0.164265
S  0.902568 0.058865 -0.640356
F  1.596685 -1.101402 0.135345
C  -0.732892 -0.048085 0.004595
H  -1.191572 -0.955966 -0.394235
H  -1.283786 0.82089 -0.365569
H  -0.713721 -0.061886 1.095956
totalener: -636.52189608 hartree
nucrepener: 197.00794441 hartree
electener: -833.52984049 hartree
oneelecener: -1259.99752862 hartree
twoeener: 426.46768813 hartree
kineticenergy: 634.37496360 hartree
exchangeener: -28.628093712386 hartree
correlationener: -2.018317131095 hartree
xcener: -30.646410843481 hartree
dispersion: -0.002164746 hartree
energy: -2451.4281 -691.6634 -691.6543 -291.7313 -236.8253 -179.4970 -179.3913 -179.1496 -45.7621 -44.3418 -32.1750 -27.9044 -24.9026 -23.9026 -23.4759 -21.9804 -21.3737 -21.2468 -19.8811 -19.8107 -17.8326 -7.5460 -6.8203 -3.6866 -1.5956 -0.9870 -0.6803 4.3026 6.0598 6.4878 6.6079 8.4272 8.9996 10.3279 11.4011 12.0879 13.1616 18.0868 18.4424 21.0123 21.2261 21.5846 24.7062 25.3512 26.3563 26.4172 27.1987 27.3235 27.6369 28.2393 28.4432 28.4937 30.6096 34.4528 35.7075 36.5129 37.2236 37.9985 40.8115 43.2505 46.8964 53.2961 55.1153 55.2812 69.9700 70.8981 366.0609 879.7018 885.2819 electronvolt
chargesum: 1.0000000
charge: -0.319421 1.411003 -0.318644 -0.852878 0.354066 0.354050 0.371824
charge: -0.239328 1.321691 -0.238767 -0.467600 0.206487 0.207159 0.210357
qa: -0.3194 1.4110 -0.3186 -0.8529 0.3541 0.3540 0.3718
va: 1.0624 3.0054 1.0638 3.5501 0.8465 0.8462 0.8392
dispersion: -0.002164525 hartree
energy: -636.509866018547 hartree
dipole: -6.62979 5.26909 -1.36070 -0.41005 0.32565 -0.08440 0.21460 -0.61891 -0.40432
magnitude: 1.42201 au
magnitude: 3.61445 debye
