program: Orca
programVersion: 5.0.4
elementType: F S F C H H H
charge: 1
multiplicity: 1
keywords: SP DSD-BLYP D3BJ def2-QZVPP def2-QZVPP/C def2/J TightSCF
formula: CH3F2S
InChI: InChI=1/CH3F2S/c1-4(2)3/h1H3
7 atoms
F  0.549811 1.233033 0.334036
S  0.029562 0.004215 -0.470585
F  0.723679 -1.156052 0.305116
C  -1.605898 -0.102735 0.174366
H  -2.064578 -1.010616 -0.224464
H  -2.156792 0.76624 -0.195798
H  -1.586727 -0.116536 1.265728
totalener: -636.72356055 hartree
nucrepener: 196.98044870 hartree
electener: -833.70400925 hartree
oneelecener: -1260.56956026 hartree
twoeener: 426.86555100 hartree
kineticenergy: 635.76924566 hartree
exchangeener: -15.895062638421 hartree
correlationener: -0.867320547851 hartree
xcener: -16.762383186273 hartree
chargesum: 1.0000000
charge: -0.201535 1.082903 -0.200780 -0.167725 0.157961 0.158010 0.171166
charge: 0.199196 0.558143 0.197952 0.157935 -0.038268 -0.036998 -0.037962
qa: -0.2015 1.0829 -0.2008 -0.1677 0.1580 0.1580 0.1712
va: 1.1486 3.3355 1.1503 3.7970 0.9882 0.9878 0.9855
total: -637.174961226 hartree
dispersion: -0.002949215 hartree
energy: -637.177910440781 hartree
dipole: -6.62979 5.18538 -1.44441 -0.41005 0.32045 -0.08960 0.21460 -0.66197 -0.44737
magnitude: 1.51476 au
magnitude: 3.85021 debye
