program: Orca
programVersion: 5.0.4
elementType: F S C H H H
charge: 2
multiplicity: 1
keywords: Opt RIJCOSX PBEh-3c
formula: CH3FS
InChI: InChI=1/CH3FS/c1-3-2/h1H3
6 atoms
F  1.973862 -0.462335 0.105376
S  1.052537 0.735613 0.026482
C  -0.481017 0.123855 -0.028451
H  -0.613149 -0.696725 -0.827608
H  -0.696946 -0.628814 0.819584
H  -1.235288 0.928406 -0.095282
totalener: -536.16412666 hartree
nucrepener: 117.33821956 hartree
electener: -653.50234622 hartree
oneelecener: -953.84375599 hartree
twoeener: 300.34140977 hartree
kineticenergy: 534.70863369 hartree
exchangeener: -22.759867039266 hartree
correlationener: -1.538725692982 hartree
xcener: -24.298592732247 hartree
dispersion: -0.001648583 hartree
energy: -2459.6247 -700.4411 -299.9171 -245.0904 -187.7129 -187.6759 -187.3909 -53.8107 -40.9132 -35.2168 -31.5986 -31.1000 -30.9861 -27.8338 -27.1396 -26.8468 -20.0735 -14.7816 -11.0195 -9.1211 -8.3818 -7.5886 -4.0568 -1.0099 -0.3869 -0.1806 0.4220 2.3817 3.1051 5.4641 5.9377 6.3894 7.7452 12.0877 12.2618 13.6580 15.1032 18.7392 19.5727 19.8918 20.3895 21.3617 23.2033 27.7877 27.8156 32.1490 34.7809 35.9857 44.7402 46.3111 46.6900 62.8425 357.1628 873.3756 electronvolt
chargesum: 2.0000000
charge: -0.159709 1.546119 -0.963042 0.544845 0.545506 0.486281
charge: -0.077486 1.527737 -0.465999 0.363215 0.365041 0.287493
qa: -0.1597 1.5461 -0.9630 0.5448 0.5455 0.4863
va: 1.3135 2.7986 3.4132 0.6877 0.6869 0.7538
dispersion: -0.001648569 hartree
energy: -536.157565559911 hartree
dipole: -6.01659 3.87175 -2.14484 -0.41239 0.58153 0.16914 -0.26297 0.16522 -0.09775
magnitude: 2.15371 au
magnitude: 5.47430 debye
