program: Orca
programVersion: 5.0.4
elementType: F Se C C C C C C H H H H H
charge: 2
multiplicity: 1
keywords: Freq RIJCOSX PBEh-3c
frequency: 0.00 0.00 0.00 0.00 0.00 0.00 89.77 140.51 173.85 301.97 315.08 348.05 376.33 556.40 581.32 700.40 804.87 820.95 834.72 988.41 1007.68 1025.89 1046.59 1051.86 1133.63 1157.07 1184.39 1283.09 1319.68 1436.49 1498.23 1527.85 1609.67 1713.12 3246.85 3268.23 3286.60 3293.67 3297.46
frequency: 89.77 140.51 173.85 301.97 315.08 348.05 376.33 556.40 581.32 700.40 804.87 820.95 834.72 988.41 1007.68 1025.89 1046.59 1051.86 1133.63 1157.07 1184.39 1283.09 1319.68 1436.49 1498.23 1527.85 1609.67 1713.12 3246.85 3268.23 3286.60 3293.67 3297.46
formula: C6H5FSe
InChI: InChI=1/C6H5FSe/c7-8-6-4-2-1-3-5-6/h1-5H
13 atoms
F  3.548547 0.336998 0.03936
Se 2.629094 -1.06244 -0.015997
C  0.984077 -0.412518 0.026402
C  0.68265 1.006044 0.119508
C  -0.617515 1.387683 0.08514
C  -1.644465 0.40507 -0.039847
C  -1.367476 -0.987024 -0.113455
C  -0.081128 -1.413215 -0.070411
H  1.473639 1.74009 0.21503
H  -0.886205 2.434744 0.151719
H  -2.678994 0.73494 -0.075811
H  -2.182913 -1.694293 -0.201165
H  0.14079 -2.47588 -0.120473
totalener: -2730.39917953 hartree
nucrepener: 578.13547907 hartree
electener: -3308.53465860 hartree
oneelecener: -4907.01580424 hartree
twoeener: 1598.48114564 hartree
kineticenergy: 2726.35584746 hartree
exchangeener: -71.987052971091 hartree
correlationener: -4.251322447815 hartree
xcener: -76.238375418906 hartree
energy: -12410.0201 -1613.1395 -1448.3245 -1448.2783 -1448.2588 -694.7592 -297.8871 -296.5950 -296.1939 -295.9214 -295.1811 -295.1546 -235.8562 -178.4229 -178.2736 -178.1916 -76.5229 -76.4444 -76.3997 -76.2403 -76.2289 -47.4533 -37.6828 -35.4198 -34.1586 -32.4613 -29.6150 -29.3264 -27.1950 -26.0424 -25.6744 -25.4202 -24.9373 -24.3487 -24.1332 -22.9690 -22.7428 -21.8190 -21.6673 -20.0330 -19.0747 -15.3993 -11.7213 -10.9150 -9.8944 -8.2621 -5.8225 -5.2238 -4.4939 -4.2589 -3.5847 -3.1611 -2.7594 -2.1634 -1.5875 -0.8776 -0.5570 1.4815 1.6882 2.3820 2.4957 3.0434 3.1864 3.9809 4.4449 4.9299 5.3410 5.8124 5.9067 6.2946 6.4774 6.9813 7.2769 7.8175 8.0410 8.6025 10.1334 11.6101 11.9900 12.5577 14.3589 16.0011 16.0146 16.4882 16.9240 17.2506 17.8491 18.3703 18.4729 19.5266 19.7263 21.4222 22.9931 23.6417 23.9188 23.9464 24.3589 24.6857 25.2826 25.6306 27.7693 28.8434 29.2693 30.2235 30.3698 30.8086 31.1959 31.7982 33.5531 34.9156 37.8743 38.5670 41.5611 44.0995 44.4843 45.3747 46.4833 46.7612 47.4470 49.0301 49.3536 51.2033 51.8859 54.3785 57.5428 60.1216 60.8490 61.6600 61.8530 62.7763 64.5351 64.7335 65.7547 71.5144 73.8964 75.2231 78.2113 80.1728 81.7768 83.7125 348.9781 359.0177 359.7998 368.9380 373.8634 382.6235 876.8147 electronvolt
chargesum: 2.0000000
charge: -0.322255 1.329685 -0.169957 -0.147462 -0.155366 -0.087468 -0.159565 -0.173089 0.369039 0.379695 0.396475 0.378689 0.361579
charge: -0.190982 1.194772 -0.087957 -0.020129 -0.049684 0.162314 -0.063028 -0.019220 0.211937 0.216290 0.221929 0.216339 0.207417
qa: -0.3223 1.3297 -0.1700 -0.1475 -0.1554 -0.0875 -0.1596 -0.1731 0.3690 0.3797 0.3965 0.3787 0.3616
va: 1.0910 2.8197 3.6239 3.6501 3.6533 3.4651 3.6791 3.6549 0.8479 0.8346 0.8210 0.8352 0.8461
dispersion: -0.007610764 hartree
energy: -2730.386513145203 hartree
dipole: -25.03537 21.95906 -3.07631 8.44562 -8.21370 0.23191 0.08222 -0.11396 -0.03174
magnitude: 3.08520 au
magnitude: 7.84197 debye
temp: 298.15 k
press: 1.00 atm
zeropoint: 0.09436326 hartree
thermalvibcorrection: 0.00449176 hartree
thermalrotcorrection: 0.00141627 hartree
thermaltrasncorrection: 0.00141627 hartree
thermaltotal: -2730.28482559 hartree
thermalcorr: 0.00732430 hartree
nonthermalcorr: 0.09436326 hartree
totalcorr: 0.10168756 hartree
thermalcorrenthalpy: 0.00094421 hartree
totalenthalpy: -2730.28388138 hartree
vibrat: 0.00756558 hartree
rotat: 0.01387900 hartree
transl: 0.01966433 hartree
total: 0.04110890 hartree
totalentropycorr: -0.04110890 hartree
gibbsenthalpy: -2730.32499028 hartree
gibbsminuselec: 0.06152286 hartree
