program: Orca
programVersion: 5.0.4
elementType: F Se C C C C C C H H H H H
charge: 2
multiplicity: 1
keywords: Opt RIJCOSX PBEh-3c
formula: C6H5FSe
InChI: InChI=1/C6H5FSe/c7-8-6-4-2-1-3-5-6/h1-5H
13 atoms
F  3.548547 0.336998 0.03936
Se 2.629094 -1.06244 -0.015997
C  0.984077 -0.412518 0.026402
C  0.68265 1.006044 0.119508
C  -0.617515 1.387683 0.08514
C  -1.644465 0.40507 -0.039847
C  -1.367476 -0.987024 -0.113455
C  -0.081128 -1.413215 -0.070411
H  1.473639 1.74009 0.21503
H  -0.886205 2.434744 0.151719
H  -2.678994 0.73494 -0.075811
H  -2.182913 -1.694293 -0.201165
H  0.14079 -2.47588 -0.120473
totalener: -2730.39917911 hartree
nucrepener: 578.12007767 hartree
electener: -3308.51925678 hartree
oneelecener: -4906.98372929 hartree
twoeener: 1598.46447252 hartree
kineticenergy: 2726.35417807 hartree
exchangeener: -71.986963012887 hartree
correlationener: -4.251313508783 hartree
xcener: -76.238276521671 hartree
dispersion: -0.007610646 hartree
energy: -12410.0218 -1613.1411 -1448.3261 -1448.2799 -1448.2604 -694.7601 -297.8873 -296.5964 -296.1921 -295.9238 -295.1799 -295.1558 -235.8570 -178.4237 -178.2743 -178.1923 -76.5237 -76.4452 -76.4005 -76.2411 -76.2297 -47.4539 -37.6830 -35.4200 -34.1588 -32.4616 -29.6151 -29.3266 -27.1952 -26.0426 -25.6747 -25.4206 -24.9376 -24.3486 -24.1334 -22.9693 -22.7429 -21.8192 -21.6675 -20.0332 -19.0748 -15.3995 -11.7213 -10.9151 -9.8946 -8.2622 -5.8227 -5.2238 -4.4939 -4.2590 -3.5849 -3.1611 -2.7595 -2.1635 -1.5877 -0.8776 -0.5571 1.4814 1.6882 2.3819 2.4956 3.0433 3.1862 3.9806 4.4447 4.9300 5.3406 5.8124 5.9067 6.2943 6.4772 6.9810 7.2769 7.8172 8.0409 8.6024 10.1333 11.6100 11.9899 12.5578 14.3588 16.0009 16.0147 16.4879 16.9238 17.2505 17.8490 18.3702 18.4727 19.5265 19.7263 21.4222 22.9930 23.6413 23.9185 23.9461 24.3586 24.6856 25.2823 25.6303 27.7690 28.8433 29.2689 30.2232 30.3695 30.8083 31.1957 31.7982 33.5529 34.9153 37.8743 38.5667 41.5609 44.0991 44.4843 45.3744 46.4830 46.7610 47.4468 49.0299 49.3534 51.2031 51.8856 54.3784 57.5425 60.1214 60.8487 61.6598 61.8528 62.7760 64.5350 64.7333 65.7545 71.5141 73.8961 75.2228 78.2110 80.1725 81.7765 83.7122 348.9777 359.0174 359.7994 368.9376 373.8632 382.6231 876.8138 electronvolt
chargesum: 2.0000000
charge: -0.322244 1.329670 -0.169958 -0.147300 -0.155501 -0.087389 -0.159483 -0.173225 0.369023 0.379695 0.396461 0.378676 0.361575
charge: -0.190970 1.194760 -0.087959 -0.019990 -0.049792 0.162376 -0.062952 -0.019351 0.211925 0.216291 0.221919 0.216331 0.207413
qa: -0.3222 1.3297 -0.1700 -0.1473 -0.1555 -0.0874 -0.1595 -0.1732 0.3690 0.3797 0.3965 0.3787 0.3616
va: 1.0910 2.8197 3.6239 3.6501 3.6533 3.4651 3.6791 3.6550 0.8479 0.8346 0.8210 0.8352 0.8461
dispersion: -0.007610764 hartree
energy: -2730.386513126522 hartree
dipole: -25.03537 21.95907 -3.07629 8.44562 -8.21341 0.23221 0.08222 -0.11395 -0.03173
magnitude: 3.08521 au
magnitude: 7.84198 debye
