program: Orca
programVersion: 5.0.4
elementType: F Se F C F F F C C C C C C H H H H H
charge: 0
multiplicity: 1
keywords: SP DSD-BLYP D3BJ def2-QZVPP def2-QZVPP/C def2/J TightSCF
formula: C7H5F5Se
InChI: InChI=1/C7H5F5Se/c8-7(9,10)13(11,12)6-4-2-1-3-5-6/h1-5H
18 atoms
F  -0.564952 -1.535206 -1.304734
Se -0.612189 -0.783642 0.349353
F  -0.756738 0.189901 1.885958
C  -1.606623 0.769929 -0.453588
F  -1.650174 0.703201 -1.766837
F  -2.843553 0.727927 0.023215
F  -1.04873 1.913319 -0.104997
C  1.212986 -0.185123 0.140049
C  1.797194 0.582731 1.140001
C  3.128131 0.948678 1.01579
C  3.868302 0.552692 -0.086526
C  3.273546 -0.215962 -1.074249
C  1.944081 -0.594316 -0.968487
H  1.237099 0.898345 2.005105
H  3.583901 1.548281 1.791963
H  4.907459 0.839983 -0.174166
H  3.843507 -0.531026 -1.937724
H  1.497511 -1.195495 -1.743949
totalener: -3168.15713058 hartree
nucrepener: 1334.66604220 hartree
electener: -4502.82317278 hartree
oneelecener: -7060.80358502 hartree
twoeener: 2557.98041225 hartree
kineticenergy: 3164.97821080 hartree
exchangeener: -54.092405911282 hartree
correlationener: -2.690257329090 hartree
xcener: -56.782663240372 hartree
chargesum: 0.0000000
charge: -0.526701 0.895129 -0.533680 0.662704 -0.203665 -0.220664 -0.215715 -0.019684 -0.071608 -0.092246 -0.092091 -0.089542 -0.083393 0.139704 0.105422 0.100814 0.106258 0.138957
charge: -0.202177 0.857809 -0.202900 -1.407838 0.408461 0.385349 0.404774 -0.273525 0.047379 0.075620 0.084112 0.075401 0.046626 -0.067988 -0.055121 -0.053340 -0.055321 -0.067321
qa: -0.5267 0.8951 -0.5337 0.6627 -0.2037 -0.2207 -0.2157 -0.0197 -0.0716 -0.0922 -0.0921 -0.0895 -0.0834 0.1397 0.1054 0.1008 0.1063 0.1390
va: 0.6985 3.2631 0.6889 4.1366 1.0951 1.0667 1.0779 3.7445 3.7181 3.7731 3.8536 3.7749 3.7327 1.0012 0.9838 0.9848 0.9830 0.9970
total: -3169.676815075 hartree
dispersion: -0.016043844 hartree
energy: -3169.692858919589 hartree
dipole: 26.79581 -25.42449 1.37132 7.67298 -7.61783 0.05515 -2.47476 2.47389 -0.00087
magnitude: 1.37243 au
magnitude: 3.48844 debye
