program: Orca
programVersion: 5.0.4
elementType: O Se C F F F C C C C C C H H H H H
charge: 0
multiplicity: 1
keywords: SP DSD-BLYP D3BJ def2-QZVPP def2-QZVPP/C def2/J TightSCF
formula: C7H5F3OSe
InChI: InChI=1/C7H5F3OSe/c8-7(9,10)12(11)6-4-2-1-3-5-6/h1-5H
17 atoms
O  0.817304 1.997675 -0.659321
Se 0.64732 0.405638 -0.911883
C  1.567332 -0.42605 0.665826
F  2.876247 -0.248352 0.523776
F  1.188106 0.106042 1.814204
F  1.319919 -1.73558 0.694801
C  -1.106154 -0.024498 -0.239569
C  -1.821335 0.975561 0.399025
C  -3.100311 0.693273 0.855551
C  -3.646501 -0.568829 0.67086
C  -2.922063 -1.55691 0.018869
C  -1.64494 -1.28591 -0.4472
H  -1.389222 1.960109 0.528146
H  -3.671748 1.462436 1.357571
H  -4.644369 -0.782486 1.030133
H  -3.351779 -2.538132 -0.130946
H  -1.088644 -2.056437 -0.967245
totalener: -3043.83573725 hartree
nucrepener: 1117.98355441 hartree
electener: -4161.81929166 hartree
oneelecener: -6452.70835844 hartree
twoeener: 2290.88906678 hartree
kineticenergy: 3040.82371624 hartree
exchangeener: -50.373166810950 hartree
correlationener: -2.473478977611 hartree
xcener: -52.846645788561 hartree
chargesum: -0.0000000
charge: -0.686778 0.686181 0.630686 -0.227598 -0.224161 -0.244349 -0.047375 -0.063932 -0.090870 -0.096013 -0.090443 -0.069218 0.138585 0.106620 0.099939 0.101120 0.077607
charge: -0.338613 0.890875 -1.414491 0.374354 0.396574 0.367207 -0.309864 0.049244 0.078589 0.082172 0.073767 0.025611 -0.050611 -0.055523 -0.054538 -0.056598 -0.058156
qa: -0.6868 0.6862 0.6307 -0.2276 -0.2242 -0.2443 -0.0474 -0.0639 -0.0909 -0.0960 -0.0904 -0.0692 0.1386 0.1066 0.0999 0.1011 0.0776
va: 1.7380 3.5074 4.0422 1.0557 1.0762 1.0382 3.6772 3.7195 3.7904 3.8541 3.8155 3.7463 0.9957 0.9839 0.9851 0.9844 1.0027
total: -3045.205769231 hartree
dispersion: -0.015499311 hartree
energy: -3045.221268542494 hartree
dipole: -24.90732 23.55222 -1.35510 -4.23718 2.98464 -1.25254 8.26643 -8.41989 -0.15347
magnitude: 1.85167 au
magnitude: 4.70657 debye
