program: Orca
programVersion: 5.0.4
elementType: N Se N O H H H H
charge: 0
multiplicity: 1
keywords: Freq RIJCOSX PBEh-3c
frequency: 0.00 0.00 0.00 0.00 0.00 0.00 176.27 246.52 290.26 360.32 363.11 545.16 589.64 671.32 750.17 989.64 996.67 1046.25 1626.60 1637.22 3566.94 3568.89 3694.23 3694.82
frequency: 176.27 246.52 290.26 360.32 363.11 545.16 589.64 671.32 750.17 989.64 996.67 1046.25 1626.60 1637.22 3566.94 3568.89 3694.23 3694.82
formula: H4N2OSe
InChI: InChI=1/H4N2OSe/c1-4(2)3/h1-2H2
8 atoms
N  -1.401261 -0.432516 -0.189893
Se -0.034033 0.564947 -0.896522
N  1.478415 0.066724 0.01383
O  -0.329385 2.0116 -0.265722
H  -1.331889 -1.433489 -0.328358
H  -1.612287 -0.209081 0.776742
H  1.467972 0.33026 0.99329
H  1.762367 -0.898345 -0.103266
totalener: -2587.12484228 hartree
nucrepener: 313.49071132 hartree
electener: -2900.61555360 hartree
oneelecener: -4221.45371896 hartree
twoeener: 1320.83816536 hartree
kineticenergy: 2584.21104697 hartree
exchangeener: -61.183153915550 hartree
correlationener: -3.303922994365 hartree
xcener: -64.487076909915 hartree
energy: -12397.8642 -1600.9542 -1436.1406 -1436.1218 -1436.0561 -529.2441 -398.5297 -398.5281 -223.7620 -166.3115 -166.2566 -166.0796 -64.4376 -64.4240 -64.2348 -64.2341 -64.1633 -29.7166 -26.5590 -26.0260 -19.6003 -15.7714 -15.3886 -14.9469 -12.8377 -11.1966 -10.0233 -8.9995 -8.5247 -8.1013 1.3173 1.6087 2.9171 3.8453 4.6506 4.9517 5.4002 9.0392 13.0956 14.0336 14.5908 15.1973 15.5540 15.9636 19.0014 20.8527 21.9250 24.5920 24.8575 25.6514 26.2121 26.9848 27.3400 27.5671 28.1322 28.8558 30.7849 32.3169 33.5236 38.7639 40.7970 46.7977 47.3370 47.9086 51.0555 52.3705 52.7718 54.5381 56.3237 57.2099 59.0982 60.1546 61.8562 62.8816 66.2955 68.3579 69.0521 89.0106 89.5287 90.0728 94.1606 95.9963 517.4718 519.3753 695.7681 electronvolt
chargesum: -0.0000000
charge: -0.913169 1.123472 -0.912682 -0.695591 0.340966 0.358137 0.358005 0.340862
charge: -0.605075 0.844144 -0.605006 -0.577699 0.232037 0.239837 0.239813 0.231950
qa: -0.9132 1.1235 -0.9127 -0.6956 0.3410 0.3581 0.3580 0.3409
va: 2.7101 3.5802 2.7102 1.8266 0.8539 0.8495 0.8496 0.8540
dispersion: -0.002985080 hartree
energy: -2587.107797681134 hartree
dipole: 0.27651 0.03288 0.30939 -4.29936 2.31907 -1.98028 6.57062 -6.13735 0.43327
magnitude: 2.05060 au
magnitude: 5.21222 debye
temp: 298.15 k
press: 1.00 atm
zeropoint: 0.05653055 hartree
thermalvibcorrection: 0.00290935 hartree
thermalrotcorrection: 0.00141627 hartree
thermaltrasncorrection: 0.00141627 hartree
thermaltotal: -2587.04552524 hartree
thermalcorr: 0.00574190 hartree
nonthermalcorr: 0.05653055 hartree
totalcorr: 0.06227244 hartree
thermalcorrenthalpy: 0.00094421 hartree
totalenthalpy: -2587.04458103 hartree
vibrat: 0.00462513 hartree
rotat: 0.01198346 hartree
transl: 0.01920981 hartree
total: 0.03581840 hartree
totalentropycorr: -0.03581840 hartree
gibbsenthalpy: -2587.08039943 hartree
gibbsminuselec: 0.02739825 hartree
