program: Orca
programVersion: 5.0.4
elementType: N Se N H H H H
charge: 2
multiplicity: 1
keywords: Freq RIJCOSX PBEh-3c
frequency: 0.00 0.00 0.00 0.00 0.00 0.00 338.34 423.51 558.35 715.27 780.22 894.78 939.25 949.84 1076.76 1620.80 1649.04 3367.71 3399.98 3487.76 3497.56
frequency: 338.34 423.51 558.35 715.27 780.22 894.78 939.25 949.84 1076.76 1620.80 1649.04 3367.71 3399.98 3487.76 3497.56
formula: H4N2Se
InChI: InChI=1/H4N2Se/c1-3-2/h1-2H2
7 atoms
N  1.316392 0.123712 0.48507
Se 0.18662 -0.951023 -0.169366
N  -1.306635 -0.169453 -0.036796
H  1.134077 1.055875 0.886091
H  2.308609 -0.164087 0.506577
H  -1.491798 0.764313 0.359363
H  -2.147364 -0.659336 -0.384838
totalener: -2511.27216171 hartree
nucrepener: 208.62943018 hartree
electener: -2719.90159190 hartree
oneelecener: -3880.44822231 hartree
twoeener: 1160.54663041 hartree
kineticenergy: 2508.80583698 hartree
exchangeener: -56.212696646585 hartree
correlationener: -2.844105057358 hartree
xcener: -59.056801703944 hartree
energy: -12412.3988 -1615.5413 -1450.7039 -1450.6958 -1450.6599 -413.2988 -413.2979 -238.2950 -180.7995 -180.7600 -180.6478 -78.9011 -78.8735 -78.8387 -78.7270 -78.7068 -42.5554 -40.0964 -34.1924 -29.8329 -29.7406 -28.0286 -25.5663 -25.5180 -22.5431 -15.9752 -12.1929 -11.1252 -7.9042 -7.0571 -6.3990 -5.4045 -4.9499 -0.4478 -0.1687 0.7367 1.8376 1.9361 2.6342 6.7620 7.3157 9.1852 9.2266 9.9044 13.6867 13.8211 14.2038 14.4837 16.3435 18.1426 19.6591 24.2666 27.3471 32.3839 32.4020 37.6400 38.0943 45.6242 45.6810 47.9758 49.0727 52.5285 52.5944 71.6653 72.1138 74.8950 77.2344 79.5916 501.7455 504.3865 electronvolt
chargesum: 2.0000000
charge: -0.776749 1.447824 -0.776893 0.519544 0.533360 0.519575 0.533339
charge: -0.325658 1.230480 -0.325725 0.348425 0.361990 0.348468 0.362020
qa: -0.7767 1.4478 -0.7769 0.5195 0.5334 0.5196 0.5333
va: 3.0571 3.0178 3.0570 0.7223 0.7059 0.7223 0.7060
dispersion: -0.002225724 hartree
energy: -2511.257620725955 hartree
dipole: -1.24173 0.98672 -0.25500 6.32672 -5.03654 1.29018 2.69155 -2.13761 0.55393
magnitude: 1.42704 au
magnitude: 3.62724 debye
temp: 298.15 k
press: 1.00 atm
zeropoint: 0.05399067 hartree
thermalvibcorrection: 0.00121620 hartree
thermalrotcorrection: 0.00141627 hartree
thermaltrasncorrection: 0.00141627 hartree
thermaltotal: -2511.19958131 hartree
thermalcorr: 0.00404874 hartree
nonthermalcorr: 0.05399067 hartree
totalcorr: 0.05803942 hartree
thermalcorrenthalpy: 0.00094421 hartree
totalenthalpy: -2511.19863710 hartree
vibrat: 0.00171253 hartree
rotat: 0.01119643 hartree
transl: 0.01901912 hartree
total: 0.03192808 hartree
totalentropycorr: -0.03192808 hartree
gibbsenthalpy: -2511.23056518 hartree
gibbsminuselec: 0.02705554 hartree
