program: Orca
programVersion: 5.0.4
elementType: N Se F N C H H H H H H
charge: 1
multiplicity: 1
keywords: SP DSD-BLYP D3BJ def2-QZVPP def2-QZVPP/C def2/J TightSCF
formula: CH6FN2Se
InChI: InChI=1/CH6FN2Se/c1-4-5(2)3/h4H,3H2,1H3
11 atoms
N  1.000585 0.409797 -1.234603
Se 0.312419 0.231796 0.358865
F  0.544645 -1.453844 0.634846
N  -1.370632 0.33923 -0.03448
C  -1.997604 -0.114841 -1.277939
H  0.74163 -0.238452 -1.973049
H  1.984837 0.656933 -1.253176
H  -1.971333 0.404234 0.780859
H  -1.572748 0.414886 -2.128058
H  -1.929322 -1.192876 -1.420267
H  -3.047304 0.159708 -1.221411
totalener: -2650.99347093 hartree
nucrepener: 427.50091893 hartree
electener: -3078.49438986 hartree
oneelecener: -4520.86326541 hartree
twoeener: 1442.36887555 hartree
kineticenergy: 2648.69768781 hartree
exchangeener: -36.001711419660 hartree
correlationener: -1.532507319080 hartree
xcener: -37.534218738740 hartree
chargesum: 1.0000000
charge: -0.427358 1.203027 -0.370601 -0.385051 -0.020918 0.238866 0.227184 0.215781 0.098409 0.110721 0.109939
charge: 0.418370 0.961961 -0.065737 0.266379 0.151794 -0.186653 -0.190346 -0.193968 -0.059713 -0.060510 -0.041576
qa: -0.4274 1.2030 -0.3706 -0.3851 -0.0209 0.2389 0.2272 0.2158 0.0984 0.1107 0.1099
va: 3.1246 3.5219 0.9405 3.1011 3.8005 0.9966 1.0021 1.0098 0.9884 0.9875 0.9945
total: -2651.711109418 hartree
dispersion: -0.006455344 hartree
energy: -2651.717564762532 hartree
dipole: -9.15671 8.76064 -0.39607 -0.84158 1.41840 0.57681 -11.05606 10.22646 -0.82960
magnitude: 1.08527 au
magnitude: 2.75855 debye
